program: Orca
programVersion: 5.0.2
elementType: O O O N N C C C C C C C C C C C C C C C C C C H H H H H H H H H H H H H H H H H H H H H H H H H H H H
charge: 0
multiplicity: 1
keywords: wb97x-d3
keywords: def2-TZVPP
keywords: def2/J RIJCOSX
keywords: DEFGRID2
keywords: scfconv7
keywords: smallprint printgap noloewdin
keywords: NOSOSCF
formula: C18H28N2O3
InChI: InChI=1/C18H28N2O3/c1-11(2)16(20-18(22)23-12(3)4)17(21)19-14(6)15-9-7-13(5)8-10-15/h7-12,14,16,19-20H,1-6H3
51 atoms
O  2.25217 -2.012727 -1.513796
O  0.408222 2.819098 0.037668
O  0.546037 1.530991 -1.815654
N  0.822869 -1.201691 0.042567
N  1.98828 1.277771 -0.08858
C  2.700729 0.176415 -0.686701
C  4.035463 -0.086607 0.035957
C  1.8877 -1.116134 -0.754802
C  -0.038123 -2.370819 0.15097
C  4.934246 1.142999 -0.018227
C  3.866888 -0.583203 1.468644
C  -1.481997 -1.925334 0.184062
C  0.345154 -3.22136 1.356086
C  0.941209 1.855241 -0.709282
C  -2.343967 -2.249909 -0.856231
C  -1.981031 -1.164794 1.239955
C  -4.163445 -1.049191 0.195584
C  -3.665186 -1.822095 -0.849041
C  -3.297956 -0.732472 1.242073
C  -0.838068 3.41972 -0.38322
C  -5.574803 -0.543255 0.184284
C  -0.938997 4.731185 0.363198
C  -1.995415 2.489662 -0.075496
H  2.941774 0.429198 -1.723019
H  4.52246 -0.878448 -0.538426
H  0.112257 -2.961446 -0.752781
H  5.934252 0.893747 0.338121
H  4.56157 1.954184 0.610007
H  5.030621 1.524238 -1.036124
H  3.35159 0.139724 2.105346
H  3.319896 -1.525431 1.522959
H  4.846401 -0.756465 1.915815
H  0.649164 -0.442288 0.685537
H  2.241325 1.593316 0.836503
H  -0.297566 -4.099305 1.422563
H  1.376688 -3.564563 1.269254
H  0.25071 -2.6620 2.287701
H  -1.981101 -2.84575 -1.685616
H  -1.339825 -0.899447 2.073287
H  -4.315088 -2.093036 -1.672773
H  -3.660048 -0.137588 2.07252
H  -0.792622 3.61911 -1.456064
H  -5.62378 0.466616 -0.228634
H  -6.222102 -1.173018 -0.425275
H  -5.99417 -0.4985 1.189171
H  -0.098581 5.387816 0.137299
H  -1.851544 5.247707 0.066816
H  -0.9791 4.575656 1.44251
H  -2.05061 2.272768 0.992467
H  -1.923458 1.546578 -0.617202
H  -2.932125 2.964596 -0.368759
elementType: O N C H
totalener: -1038.15691881 hartree
nucrepener: 2070.67033735 hartree
electener: -3108.82725616 hartree
oneelecener: -5526.59379587 hartree
twoeener: 2417.76653971 hartree
cpcmener: -0.05367942 hartree
kineticenergy: 1033.39412352 hartree
xcener: -101.564199638175 hartree
chargesum: -0.0000000
charge: -0.572289 -0.338286 -0.555128 -0.167528 -0.260641 0.095359 0.063974 0.283303 0.195615 -0.302039 -0.307435 -0.022912 -0.301333 0.519911 -0.153826 -0.185004 0.011285 -0.174031 -0.244187 0.175272 -0.201065 -0.260139 -0.264127 0.110016 0.050842 0.064564 0.099039 0.085418 0.097260 0.088263 0.092985 0.102920 0.182595 0.185809 0.106032 0.104577 0.096446 0.144508 0.148489 0.142914 0.144282 0.068980 0.102034 0.095367 0.097661 0.098427 0.092484 0.090195 0.088798 0.077738 0.106607
qa: -0.5723 -0.3383 -0.5551 -0.1675 -0.2606 0.0954 0.0640 0.2833 0.1956 -0.3020 -0.3074 -0.0229 -0.3013 0.5199 -0.1538 -0.1850 0.0113 -0.1740 -0.2442 0.1753 -0.2011 -0.2601 -0.2641 0.1100 0.0508 0.0646 0.0990 0.0854 0.0973 0.0883 0.0930 0.1029 0.1826 0.1858 0.1060 0.1046 0.0964 0.1445 0.1485 0.1429 0.1443 0.0690 0.1020 0.0954 0.0977 0.0984 0.0925 0.0902 0.0888 0.0777 0.1066
va: 1.9460 2.0839 1.9479 3.2190 3.1757 3.8062 3.7879 4.2023 3.7275 3.9471 3.9532 3.6008 3.9542 4.3085 3.9356 3.8870 3.6826 3.9246 3.9131 3.8306 3.8966 3.9440 3.8888 1.0347 1.0347 1.0572 1.0037 1.0049 1.0039 1.0031 1.0089 1.0046 1.0151 1.0163 1.0074 1.0032 1.0011 1.0007 1.0019 1.0003 1.0007 1.0210 0.9938 1.0026 1.0006 1.0080 1.0048 1.0059 1.0054 1.0193 1.0076
dispcorr: -0.027209615 hartree
energy: -1038.184128425247
dipole: -0.66916 -0.13779 -0.80694 6.79442 -5.21996 1.57446 11.22035 -8.16097 3.05938
magnitude: 3.53411 au
magnitude: 8.98299 debye
