program: Orca
programVersion: 5.0.2
elementType: O O O N N C C C C C C C C C C C C C C C C C C H H H H H H H H H H H H H H H H H H H H H H H H H H H H
charge: 0
multiplicity: 1
keywords: wb97x-d3
keywords: def2-TZVPP
keywords: def2/J RIJCOSX
keywords: DEFGRID2
keywords: scfconv7
keywords: smallprint printgap noloewdin
keywords: NOSOSCF
formula: C18H28N2O3
InChI: InChI=1/C18H28N2O3/c1-11(2)16(20-18(22)23-12(3)4)17(21)19-14(6)15-9-7-13(5)8-10-15/h7-12,14,16,19-20H,1-6H3
51 atoms
O  1.914832 -2.282777 -1.026382
O  0.731669 3.061419 0.69958
O  0.542853 2.388672 -1.447181
N  0.487671 -1.305586 0.433813
N  1.604287 1.121897 0.119869
C  2.080091 0.088546 -0.766801
C  3.616087 0.043723 -0.83398
C  1.486547 -1.284643 -0.449081
C  -0.258616 -2.491394 0.821577
C  4.161582 1.354071 -1.386549
C  4.255115 -0.295344 0.508251
C  -1.693098 -2.405046 0.349896
C  -0.174374 -2.695913 2.328971
C  0.93299 2.213171 -0.306905
C  -2.526916 -1.367688 0.764854
C  -2.22255 -3.376522 -0.489169
C  -4.383982 -2.285892 -0.490218
C  -3.847172 -1.309714 0.350045
C  -3.548873 -3.319371 -0.900713
C  0.067673 4.318171 0.434163
C  -5.809018 -2.203925 -0.94939
C  1.049736 5.315902 -0.145921
C  -0.503054 4.778553 1.757351
H  1.712632 0.325136 -1.769153
H  3.871417 -0.746942 -1.542607
H  0.211578 -3.341874 0.329115
H  3.720247 1.594258 -2.355454
H  5.241722 1.287728 -1.523529
H  3.970726 2.192466 -0.713934
H  4.079682 0.481646 1.25585
H  3.892128 -1.240221 0.916724
H  5.33632 -0.386766 0.39757
H  0.192879 -0.425161 0.831584
H  1.960236 1.13396 1.06584
H  -0.732033 -3.584952 2.622702
H  0.861038 -2.82713 2.644153
H  -0.589715 -1.844485 2.87069
H  -2.149601 -0.593483 1.424425
H  -1.596024 -4.195064 -0.824211
H  -4.474308 -0.493438 0.689451
H  -3.936518 -4.094885 -1.550944
H  -0.750072 4.14591 -0.268804
H  -5.917181 -1.494135 -1.772196
H  -6.173027 -3.168057 -1.302464
H  -6.468281 -1.86665 -0.149394
H  1.465585 4.982353 -1.096337
H  0.541025 6.263423 -0.325542
H  1.872441 5.504174 0.545622
H  -1.202347 4.050482 2.16905
H  -1.046065 5.711928 1.610413
H  0.282507 4.961488 2.492128
elementType: O N C H
totalener: -1038.15656853 hartree
nucrepener: 1994.28541187 hartree
electener: -3032.44198041 hartree
oneelecener: -5373.58172805 hartree
twoeener: 2341.13974764 hartree
cpcmener: -0.04913940 hartree
kineticenergy: 1033.39274705 hartree
xcener: -101.563643842915 hartree
chargesum: -0.0000000
charge: -0.583108 -0.338177 -0.555916 -0.188562 -0.268856 0.092959 0.073640 0.309712 0.201630 -0.319527 -0.298294 -0.022982 -0.279608 0.542572 -0.201846 -0.165956 -0.015343 -0.188844 -0.175611 0.159026 -0.204143 -0.262948 -0.256576 0.112078 0.037720 0.067967 0.098457 0.104253 0.084340 0.083753 0.095254 0.098666 0.184010 0.182176 0.100817 0.101935 0.095542 0.144678 0.144495 0.143405 0.143273 0.067253 0.103084 0.093614 0.098022 0.093262 0.098901 0.090028 0.097684 0.092290 0.089802
qa: -0.5831 -0.3382 -0.5559 -0.1886 -0.2689 0.0930 0.0736 0.3097 0.2016 -0.3195 -0.2983 -0.0230 -0.2796 0.5426 -0.2018 -0.1660 -0.0153 -0.1888 -0.1756 0.1590 -0.2041 -0.2629 -0.2566 0.1121 0.0377 0.0680 0.0985 0.1043 0.0843 0.0838 0.0953 0.0987 0.1840 0.1822 0.1008 0.1019 0.0955 0.1447 0.1445 0.1434 0.1433 0.0673 0.1031 0.0936 0.0980 0.0933 0.0989 0.0900 0.0977 0.0923 0.0898
va: 1.9286 2.0797 1.9441 3.2355 3.1774 3.8085 3.8236 4.2539 3.7172 3.9440 3.9363 3.6322 3.9564 4.2859 3.9632 3.9558 3.7233 3.9438 3.9216 3.8248 3.9001 3.8981 3.9380 1.0383 1.0425 1.0570 1.0036 1.0038 1.0071 1.0049 1.0100 1.0036 1.0166 1.0181 1.0050 1.0065 1.0009 1.0036 1.0019 1.0000 1.0003 1.0219 0.9936 1.0034 0.9991 1.0186 1.0066 1.0069 1.0078 1.0050 1.0061
dispcorr: -0.023859186 hartree
energy: -1038.180427719735
dipole: 4.25311 -4.95935 -0.70624 11.50036 -10.04235 1.45801 6.78880 -4.26458 2.52422
magnitude: 2.99937 au
magnitude: 7.62380 debye
