program: Orca
programVersion: 5.0.2
elementType: O O O N N C C C C C C C C C C C C C C C C C C H H H H H H H H H H H H H H H H H H H H H H H H H H H H
charge: 0
multiplicity: 1
keywords: wb97x-d3
keywords: def2-TZVPP
keywords: def2/J RIJCOSX
keywords: DEFGRID2
keywords: scfconv7
keywords: smallprint printgap noloewdin
keywords: NOSOSCF
formula: C18H28N2O3
InChI: InChI=1/C18H28N2O3/c1-11(2)16(20-18(22)23-12(3)4)17(21)19-14(6)15-9-7-13(5)8-10-15/h7-12,14,16,19-20H,1-6H3
51 atoms
O  1.135545 -1.966464 -1.441201
O  0.787751 3.037854 0.609684
O  -0.116288 1.782715 -1.040099
N  0.783181 -1.078651 0.601474
N  1.912236 1.296968 -0.156144
C  2.142052 0.15633 -1.00825
C  3.632777 -0.22687 -1.051776
C  1.29359 -1.055825 -0.630721
C  -0.115927 -2.120093 1.06781
C  4.479444 0.932947 -1.562421
C  4.164773 -0.755735 0.275626
C  -1.462776 -2.033012 0.385166
C  -0.253155 -2.014767 2.579457
C  0.783925 2.027289 -0.255748
C  -2.179629 -0.83828 0.370228
C  -2.024089 -3.146283 -0.222115
C  -4.001214 -1.889806 -0.830459
C  -3.427013 -0.769967 -0.226909
C  -3.277794 -3.076971 -0.818958
C  -0.326683 3.95784 0.622863
C  -5.363602 -1.810488 -1.452055
C  0.199732 5.238184 1.23301
C  -1.482772 3.379927 1.412155
H  1.84935 0.413357 -2.030359
H  3.699251 -1.034022 -1.785579
H  0.329218 -3.089473 0.830374
H  5.506084 0.603785 -1.72634
H  4.51726 1.76092 -0.851977
H  4.100473 1.320859 -2.509345
H  5.224281 -0.995029 0.179311
H  4.075427 -0.026468 1.083662
H  3.658774 -1.668563 0.590311
H  0.930575 -0.280815 1.201499
H  2.633856 1.59781 0.482029
H  -0.691637 -1.059191 2.872679
H  -0.898368 -2.808522 2.952556
H  0.716765 -2.11177 3.068633
H  -1.766424 0.049651 0.835254
H  -1.478709 -4.082816 -0.230776
H  -3.965773 0.170472 -0.225577
H  -3.693192 -3.960887 -1.288132
H  -0.63616 4.15144 -0.406066
H  -5.583773 -2.695451 -2.047866
H  -6.13994 -1.728347 -0.68892
H  -5.45984 -0.937362 -2.098007
H  0.515144 5.088884 2.266583
H  1.041531 5.636433 0.666665
H  -0.586928 5.991996 1.230836
H  -2.306828 4.093418 1.420559
H  -1.195889 3.189796 2.447126
H  -1.857666 2.452229 0.980874
elementType: O N C H
totalener: -1038.15789332 hartree
nucrepener: 2058.45218430 hartree
electener: -3096.61007762 hartree
oneelecener: -5502.98979855 hartree
twoeener: 2406.37972093 hartree
cpcmener: -0.05670649 hartree
kineticenergy: 1033.41679841 hartree
xcener: -101.568266366073 hartree
chargesum: 0.0000000
charge: -0.566745 -0.338304 -0.557312 -0.173498 -0.254910 0.104786 0.065762 0.266716 0.156324 -0.301625 -0.306931 0.043477 -0.286911 0.524845 -0.243087 -0.182773 -0.018091 -0.194542 -0.166293 0.169675 -0.206486 -0.260611 -0.260280 0.109174 0.049920 0.089267 0.098528 0.085329 0.097170 0.101090 0.088477 0.093515 0.181958 0.186447 0.096996 0.101273 0.108739 0.156773 0.140125 0.141840 0.142615 0.067699 0.091891 0.102814 0.100011 0.089952 0.097550 0.093263 0.102784 0.090926 0.080687
qa: -0.5667 -0.3383 -0.5573 -0.1735 -0.2549 0.1048 0.0658 0.2667 0.1563 -0.3016 -0.3069 0.0435 -0.2869 0.5248 -0.2431 -0.1828 -0.0181 -0.1945 -0.1663 0.1697 -0.2065 -0.2606 -0.2603 0.1092 0.0499 0.0893 0.0985 0.0853 0.0972 0.1011 0.0885 0.0935 0.1820 0.1864 0.0970 0.1013 0.1087 0.1568 0.1401 0.1418 0.1426 0.0677 0.0919 0.1028 0.1000 0.0900 0.0975 0.0933 0.1028 0.0909 0.0807
va: 1.9527 2.0840 1.9395 3.1881 3.1732 3.7887 3.7889 4.2035 3.7839 3.9465 3.9480 3.4749 3.9480 4.2909 3.9602 3.9767 3.7403 3.9512 3.9070 3.8112 3.9026 3.9435 3.9066 1.0369 1.0334 1.0193 1.0036 1.0049 1.0036 1.0040 1.0027 1.0121 1.0172 1.0163 0.9979 1.0055 1.0055 0.9876 1.0051 1.0006 1.0001 1.0207 1.0049 0.9937 0.9973 1.0059 1.0079 1.0049 1.0076 1.0077 1.0170
dispcorr: -0.026227668 hartree
energy: -1038.184120987785
dipole: 3.85741 -2.89446 0.96296 8.62267 -6.87066 1.75200 8.20965 -5.50925 2.70040
magnitude: 3.35991 au
magnitude: 8.54021 debye
