program: Orca
programVersion: 5.0.2
elementType: O O O N N C C C C C C C C C C C C C C C C C C H H H H H H H H H H H H H H H H H H H H H H H H H H H H
charge: 0
multiplicity: 1
keywords: wb97x-d3
keywords: def2-TZVPP
keywords: def2/J RIJCOSX
keywords: DEFGRID2
keywords: scfconv7
keywords: smallprint printgap noloewdin
keywords: NOSOSCF
formula: C18H28N2O3
InChI: InChI=1/C18H28N2O3/c1-11(2)16(20-18(22)23-12(3)4)17(21)19-14(6)15-9-7-13(5)8-10-15/h7-12,14,16,19-20H,1-6H3
51 atoms
O  1.577778 -1.96485 -1.602176
O  0.495037 2.854474 0.449105
O  0.086959 1.565923 -1.363184
N  0.919734 -1.261345 0.441815
N  1.928119 1.253818 -0.085109
C  2.415176 0.149461 -0.873732
C  3.903831 -0.130075 -0.598205
C  1.581058 -1.120346 -0.708932
C  -0.002331 -2.349115 0.721863
C  4.755705 1.079196 -0.968681
C  4.191379 -0.587307 0.827504
C  -1.407876 -2.001981 0.282077
C  0.042571 -2.683928 2.206803
C  0.775151 1.873664 -0.405214
C  -2.016514 -0.826089 0.716587
C  -2.139849 -2.863075 -0.524202
C  -4.063753 -1.394875 -0.444953
C  -3.322154 -0.53124 0.361463
C  -3.449667 -2.564212 -0.881724
C  -0.67892 3.668992 0.219946
C  -5.468163 -1.05296 -0.843825
C  -0.460548 4.93809 1.013898
C  -1.938174 2.93863 0.641485
H  2.335294 0.409522 -1.932704
H  4.173144 -0.946056 -1.274094
H  0.334096 -3.222247 0.161557
H  4.542971 1.423965 -1.981867
H  5.814262 0.821945 -0.921678
H  4.596754 1.917574 -0.288277
H  3.904054 0.158263 1.572359
H  3.685223 -1.520132 1.075234
H  5.261084 -0.759976 0.950195
H  0.953779 -0.505615 1.111104
H  2.454159 1.570846 0.716005
H  -0.651586 -3.493029 2.43001
H  1.041435 -3.003129 2.505297
H  -0.2396 -1.823724 2.816795
H  -1.473139 -0.131542 1.34827
H  -1.687587 -3.783503 -0.875112
H  -3.776139 0.385441 0.720298
H  -3.999854 -3.254439 -1.51044
H  -0.731718 3.914947 -0.843392
H  -6.028875 -1.93895 -1.139603
H  -6.007765 -0.568089 -0.030182
H  -5.479861 -0.362884 -1.69013
H  0.449179 5.454003 0.706156
H  -1.297731 5.61558 0.848815
H  -0.400686 4.735389 2.084398
H  -2.126732 2.057858 0.031407
H  -2.795259 3.602997 0.527722
H  -1.887713 2.635349 1.688654
elementType: O N C H
totalener: -1038.15679830 hartree
nucrepener: 2070.05648432 hartree
electener: -3108.21328262 hartree
oneelecener: -5525.89541114 hartree
twoeener: 2417.68212852 hartree
cpcmener: -0.05712708 hartree
kineticenergy: 1033.40312351 hartree
xcener: -101.566081612008 hartree
chargesum: -0.0000000
charge: -0.569679 -0.336311 -0.556619 -0.180096 -0.253563 0.098334 0.066623 0.280475 0.177112 -0.299091 -0.306522 0.025228 -0.284265 0.522820 -0.242111 -0.181825 -0.020924 -0.191456 -0.168732 0.176419 -0.208281 -0.261078 -0.284647 0.109853 0.050997 0.080941 0.096865 0.098432 0.085891 0.088036 0.090844 0.102336 0.181860 0.185599 0.100721 0.104712 0.095799 0.154753 0.142818 0.154359 0.141877 0.068936 0.094236 0.097506 0.103612 0.098427 0.092600 0.089741 0.083503 0.107826 0.095111
qa: -0.5697 -0.3363 -0.5566 -0.1801 -0.2536 0.0983 0.0666 0.2805 0.1771 -0.2991 -0.3065 0.0252 -0.2843 0.5228 -0.2421 -0.1818 -0.0209 -0.1915 -0.1687 0.1764 -0.2083 -0.2611 -0.2846 0.1099 0.0510 0.0809 0.0969 0.0984 0.0859 0.0880 0.0908 0.1023 0.1819 0.1856 0.1007 0.1047 0.0958 0.1548 0.1428 0.1544 0.1419 0.0689 0.0942 0.0975 0.1036 0.0984 0.0926 0.0897 0.0835 0.1078 0.0951
va: 1.9450 2.0869 1.9404 3.1988 3.1817 3.7884 3.7984 4.1954 3.7572 3.9432 3.9484 3.5572 3.9505 4.2924 3.9437 3.9741 3.7585 3.9168 3.9167 3.8239 3.9028 3.9452 3.8874 1.0382 1.0305 1.0374 1.0039 1.0040 1.0049 1.0031 1.0150 1.0040 1.0157 1.0168 1.0053 1.0056 0.9996 0.9940 1.0030 0.9919 1.0004 1.0181 1.0029 1.0000 0.9931 1.0076 1.0051 1.0059 1.0224 1.0086 1.0029
dispcorr: -0.026880488 hartree
energy: -1038.183678786256
dipole: 1.94048 -1.57904 0.36144 8.26098 -6.61931 1.64167 9.66227 -6.63070 3.03157
magnitude: 3.46643 au
magnitude: 8.81097 debye
