program: Orca
programVersion: 5.0.2
elementType: O O O N N C C C C C C C C C C C C C C C C C C H H H H H H H H H H H H H H H H H H H H H H H H H H H H
charge: 0
multiplicity: 1
keywords: wb97x-d3
keywords: def2-TZVPP
keywords: def2/J RIJCOSX
keywords: DEFGRID2
keywords: scfconv7
keywords: smallprint printgap noloewdin
keywords: NOSOSCF
formula: C18H28N2O3
InChI: InChI=1/C18H28N2O3/c1-11(2)16(20-18(22)23-12(3)4)17(21)19-14(6)15-9-7-13(5)8-10-15/h7-12,14,16,19-20H,1-6H3
51 atoms
O  -0.480486 -0.149358 -1.485654
O  1.883109 3.868297 -0.936094
O  2.845133 2.665687 0.717547
N  0.738292 -1.669451 -0.34839
N  1.125542 1.837344 -0.517353
C  0.913433 0.659241 0.292505
C  0.011092 0.944848 1.517291
C  0.325898 -0.423644 -0.599992
C  0.116991 -2.845288 -0.94696
C  -1.405234 1.369841 1.148686
C  -0.014923 -0.225703 2.491556
C  -1.247967 -3.094177 -0.340451
C  1.053708 -4.033006 -0.799165
C  2.014642 2.785249 -0.167921
C  -2.405052 -2.891787 -1.085011
C  -1.380893 -3.493187 0.986425
C  -3.796027 -3.466978 0.811019
C  -3.658716 -3.076571 -0.519051
C  -2.634661 -3.676112 1.551319
C  2.768706 4.988944 -0.722777
C  -5.153417 -3.65972 1.418779
C  2.022656 6.21482 -1.206498
C  4.073064 4.777093 -1.465088
H  1.883184 0.324634 0.666206
H  0.493754 1.785086 2.026193
H  -0.011525 -2.644708 -2.012048
H  -1.924223 1.730286 2.037595
H  -1.990365 0.538964 0.750705
H  -1.42444 2.178519 0.416655
H  -0.560964 -1.080888 2.090299
H  0.991177 -0.560477 2.751675
H  -0.512788 0.068163 3.41625
H  1.350777 -1.822314 0.440963
H  0.404409 2.079141 -1.182246
H  0.60321 -4.921764 -1.238202
H  1.998161 -3.846643 -1.310626
H  1.272895 -4.250258 0.247414
H  -2.328293 -2.58526 -2.12166
H  -0.500511 -3.657999 1.597023
H  -4.544057 -2.905576 -1.120592
H  -2.710165 -3.983035 2.587858
H  2.963076 5.08897 0.347215
H  -5.782634 -2.78077 1.273419
H  -5.676403 -4.503188 0.964473
H  -5.088566 -3.8506 2.489224
H  2.631419 7.101775 -1.033632
H  1.808525 6.159685 -2.27508
H  1.082885 6.349083 -0.670033
H  3.905044 4.694405 -2.540219
H  4.596601 3.882958 -1.126441
H  4.731921 5.628614 -1.294065
elementType: O N C H
totalener: -1038.15657886 hartree
nucrepener: 1994.91467000 hartree
electener: -3033.07124886 hartree
oneelecener: -5375.67465777 hartree
twoeener: 2342.60340891 hartree
cpcmener: -0.04542764 hartree
kineticenergy: 1033.39044818 hartree
xcener: -101.561849574137 hartree
chargesum: 0.0000000
charge: -0.561202 -0.342611 -0.572653 -0.189443 -0.252615 0.119962 0.100301 0.271064 0.207011 -0.320862 -0.337657 0.022793 -0.289403 0.532565 -0.195299 -0.239750 -0.018891 -0.179173 -0.171152 0.163545 -0.206935 -0.255234 -0.262549 0.106497 0.054348 0.090332 0.103156 0.080200 0.095216 0.078317 0.106302 0.107040 0.183186 0.173471 0.099943 0.108769 0.094894 0.139313 0.153366 0.143300 0.143979 0.063546 0.101012 0.102534 0.091885 0.091805 0.089513 0.096710 0.088744 0.092458 0.098358
qa: -0.5612 -0.3426 -0.5727 -0.1894 -0.2526 0.1200 0.1003 0.2711 0.2070 -0.3209 -0.3377 0.0228 -0.2894 0.5326 -0.1953 -0.2397 -0.0189 -0.1792 -0.1712 0.1635 -0.2069 -0.2552 -0.2625 0.1065 0.0543 0.0903 0.1032 0.0802 0.0952 0.0783 0.1063 0.1070 0.1832 0.1735 0.0999 0.1088 0.0949 0.1393 0.1534 0.1433 0.1440 0.0635 0.1010 0.1025 0.0919 0.0918 0.0895 0.0967 0.0887 0.0925 0.0984
va: 1.9327 2.0842 1.9224 3.2758 3.2019 3.8352 3.7589 4.2664 3.7511 3.9596 3.9619 3.4476 3.9506 4.2954 3.9758 3.9578 3.7320 3.9362 3.9233 3.8208 3.8999 3.9349 3.9059 1.0428 1.0246 1.0160 1.0017 1.0030 1.0099 1.0006 1.0015 1.0045 1.0011 1.0384 1.0047 1.0046 1.0003 1.0118 0.9995 0.9992 1.0001 1.0238 0.9967 0.9945 1.0056 1.0051 1.0063 1.0084 1.0072 1.0177 1.0061
dispcorr: -0.025519499 hartree
energy: -1038.182098361044
dipole: -1.36917 1.35742 -0.01175 4.14218 -5.08292 -0.94074 6.15762 -5.33503 0.82258
magnitude: 1.24971 au
magnitude: 3.17651 debye
