program: Orca
programVersion: 5.0.2
elementType: O O O N N C C C C C C C C C C C C C C C C C C H H H H H H H H H H H H H H H H H H H H H H H H H H H H
charge: 0
multiplicity: 1
keywords: wb97x-d3
keywords: def2-TZVPP
keywords: def2/J RIJCOSX
keywords: DEFGRID2
keywords: scfconv7
keywords: smallprint printgap noloewdin
keywords: NOSOSCF
formula: C18H28N2O3
InChI: InChI=1/C18H28N2O3/c1-11(2)16(20-18(22)23-12(3)4)17(21)19-14(6)15-9-7-13(5)8-10-15/h7-12,14,16,19-20H,1-6H3
51 atoms
O  -0.536634 -0.089664 -1.344226
O  1.981618 3.696339 -0.982275
O  3.191905 2.308526 0.323757
N  0.616424 -1.709119 -0.278553
N  1.041026 1.840664 -0.249995
C  0.950645 0.573689 0.428819
C  0.194987 0.645472 1.775716
C  0.276418 -0.434397 -0.491801
C  -0.099286 -2.824294 -0.87861
C  0.886528 1.612748 2.728069
C  -1.278409 1.003531 1.619485
C  -1.473689 -2.982942 -0.266627
C  0.734665 -4.087796 -0.734068
C  2.156081 2.590593 -0.255592
C  -1.625432 -3.145364 1.109648
C  -2.612928 -2.976322 -1.05853
C  -4.029937 -3.31572 0.874794
C  -2.881577 -3.308088 1.668754
C  -3.87373 -3.14281 -0.495802
C  3.099802 4.594185 -1.157799
C  -5.381741 -3.526303 1.489069
C  2.50732 5.938267 -1.520656
C  4.034864 4.071261 -2.230518
H  1.965846 0.232293 0.638399
H  0.257801 -0.356868 2.212594
H  -0.217193 -2.612695 -1.943074
H  1.94096 1.368397 2.863171
H  0.411775 1.575084 3.709326
H  0.818212 2.643626 2.375686
H  -1.412283 1.954533 1.099623
H  -1.842733 0.241197 1.081501
H  -1.740798 1.106735 2.602047
H  1.24344 -1.915282 0.486482
H  0.236151 2.161433 -0.768315
H  1.701896 -3.974395 -1.22431
H  0.908877 -4.334849 0.314614
H  0.220525 -4.929557 -1.195338
H  -0.755167 -3.145461 1.756596
H  -2.52021 -2.840779 -2.129858
H  -2.973695 -3.434556 2.741259
H  -4.74742 -3.132037 -1.136658
H  3.634653 4.684111 -0.209873
H  -5.525006 -4.570513 1.774378
H  -5.50834 -2.930228 2.393181
H  -6.182235 -3.264285 0.798431
H  1.826474 6.297908 -0.74885
H  3.308075 6.670458 -1.621539
H  1.969647 5.898222 -2.469242
H  4.47208 3.109461 -1.964467
H  4.855073 4.775513 -2.373008
H  3.516492 3.964333 -3.184809
elementType: O N C H
totalener: -1038.15803666 hartree
nucrepener: 1989.34208803 hartree
electener: -3027.50012469 hartree
oneelecener: -5364.62296178 hartree
twoeener: 2337.12283709 hartree
cpcmener: -0.04772295 hartree
kineticenergy: 1033.40555107 hartree
xcener: -101.565019398576 hartree
chargesum: -0.0000000
charge: -0.556128 -0.346251 -0.571610 -0.193657 -0.240902 0.113394 0.086167 0.270083 0.201989 -0.323844 -0.311579 0.042185 -0.283566 0.529121 -0.254228 -0.192515 -0.022224 -0.178052 -0.164222 0.162706 -0.205483 -0.257276 -0.263705 0.113366 0.050406 0.088419 0.097914 0.103077 0.087778 0.093806 0.083910 0.097901 0.180926 0.172834 0.107777 0.095589 0.098936 0.142940 0.141099 0.143428 0.142649 0.064129 0.102938 0.099166 0.092814 0.096787 0.091994 0.089365 0.091924 0.098309 0.089416
qa: -0.5561 -0.3463 -0.5716 -0.1937 -0.2409 0.1134 0.0862 0.2701 0.2020 -0.3238 -0.3116 0.0422 -0.2836 0.5291 -0.2542 -0.1925 -0.0222 -0.1781 -0.1642 0.1627 -0.2055 -0.2573 -0.2637 0.1134 0.0504 0.0884 0.0979 0.1031 0.0878 0.0938 0.0839 0.0979 0.1809 0.1728 0.1078 0.0956 0.0989 0.1429 0.1411 0.1434 0.1426 0.0641 0.1029 0.0992 0.0928 0.0968 0.0920 0.0894 0.0919 0.0983 0.0894
va: 1.9380 2.0832 1.9215 3.2353 3.2090 3.7753 3.7646 4.2940 3.7564 3.9435 3.9515 3.4529 3.9487 4.2922 3.9632 3.9958 3.7327 3.9314 3.9133 3.8255 3.9008 3.9382 3.8973 1.0423 1.0270 1.0199 1.0079 1.0055 1.0032 1.0062 1.0086 1.0041 1.0048 1.0379 1.0057 0.9991 1.0052 1.0064 1.0057 0.9995 0.9998 1.0225 0.9936 0.9982 1.0045 1.0083 1.0050 1.0058 1.0202 1.0059 1.0074
dispcorr: -0.025070153 hartree
energy: -1038.183106809992
dipole: 0.26243 -0.36445 -0.10202 5.24449 -6.33002 -1.08553 5.66599 -4.72837 0.93762
magnitude: 1.43803 au
magnitude: 3.65517 debye
