program: Orca
programVersion: 5.0.2
elementType: O O O N N C C C C C C C C C C C C C C C C C C H H H H H H H H H H H H H H H H H H H H H H H H H H H H
charge: 0
multiplicity: 1
keywords: wb97x-d3
keywords: def2-TZVPP
keywords: def2/J RIJCOSX
keywords: DEFGRID2
keywords: scfconv7
keywords: smallprint printgap noloewdin
keywords: NOSOSCF
formula: C18H28N2O3
InChI: InChI=1/C18H28N2O3/c1-11(2)16(20-18(22)23-12(3)4)17(21)19-14(6)15-9-7-13(5)8-10-15/h7-12,14,16,19-20H,1-6H3
51 atoms
O  -0.626117 -0.117066 -1.308208
O  1.700032 3.721187 -1.115658
O  3.235808 2.337379 -0.207376
N  0.668359 -1.793851 -0.536426
N  1.033772 1.776573 -0.324359
C  1.152481 0.44819 0.217844
C  0.729785 0.350693 1.70152
C  0.316581 -0.50687 -0.625411
C  -0.161784 -2.86673 -1.060538
C  1.606711 1.238204 2.574823
C  -0.746142 0.664586 1.915185
C  -1.461881 -2.987265 -0.2952
C  0.627018 -4.167159 -1.026194
C  2.08428 2.590778 -0.519602
C  -1.466073 -3.103206 1.092258
C  -2.67982 -3.014036 -0.962444
C  -3.881151 -3.28761 1.121467
C  -2.656577 -3.251456 1.787264
C  -3.871108 -3.164977 -0.265334
C  2.684217 4.744361 -1.381172
C  -5.169479 -3.428533 1.876274
C  2.906096 5.589948 -0.144249
C  2.148371 5.549575 -2.545331
H  2.199446 0.145849 0.1502
H  0.905397 -0.686963 2.003182
H  -0.39511 -2.634914 -2.101955
H  2.666175 1.011484 2.449288
H  1.3607 1.086275 3.626588
H  1.456981 2.297142 2.357494
H  -0.999714 1.669734 1.572765
H  -1.405391 -0.040071 1.406963
H  -0.98831 0.615887 2.977458
H  1.40728 -2.045262 0.105708
H  0.12146 2.080492 -0.631518
H  0.02462 -4.979767 -1.429523
H  1.534421 -4.091159 -1.62627
H  0.910561 -4.433681 -0.006382
H  -0.532256 -3.078613 1.642822
H  -2.700726 -2.920539 -2.042109
H  -2.633223 -3.345397 2.866654
H  -4.807282 -3.185549 -0.811052
H  3.621081 4.268934 -1.677807
H  -5.017169 -3.913233 2.840156
H  -5.620881 -2.453513 2.072291
H  -5.899829 -4.012446 1.316443
H  3.290336 5.003466 0.690324
H  3.636857 6.369343 -0.361804
H  1.981836 6.077184 0.170472
H  2.003692 4.926922 -3.428436
H  2.861722 6.331311 -2.805433
H  1.200145 6.030765 -2.300166
elementType: O N C H
totalener: -1038.15816609 hartree
nucrepener: 1993.37890127 hartree
electener: -3031.53706736 hartree
oneelecener: -5372.68578507 hartree
twoeener: 2341.14871770 hartree
cpcmener: -0.04830529 hartree
kineticenergy: 1033.40505575 hartree
xcener: -101.565521800830 hartree
chargesum: 0.0000000
charge: -0.553789 -0.345630 -0.571143 -0.195852 -0.242845 0.115328 0.084510 0.265707 0.197340 -0.326471 -0.312366 0.062575 -0.282868 0.529597 -0.281247 -0.195316 -0.023633 -0.168093 -0.164628 0.157253 -0.205298 -0.260701 -0.256566 0.119338 0.050562 0.088645 0.098940 0.102977 0.087532 0.094605 0.086684 0.099526 0.179987 0.171996 0.099413 0.108458 0.095647 0.144532 0.141010 0.143500 0.142839 0.065799 0.094716 0.103356 0.097039 0.092018 0.097802 0.088884 0.096933 0.091854 0.089544
qa: -0.5538 -0.3456 -0.5711 -0.1959 -0.2428 0.1153 0.0845 0.2657 0.1973 -0.3265 -0.3124 0.0626 -0.2829 0.5296 -0.2812 -0.1953 -0.0236 -0.1681 -0.1646 0.1573 -0.2053 -0.2607 -0.2566 0.1193 0.0506 0.0886 0.0989 0.1030 0.0875 0.0946 0.0867 0.0995 0.1800 0.1720 0.0994 0.1085 0.0956 0.1445 0.1410 0.1435 0.1428 0.0658 0.0947 0.1034 0.0970 0.0920 0.0978 0.0889 0.0969 0.0919 0.0895
va: 1.9406 2.0821 1.9214 3.2347 3.2069 3.7692 3.7614 4.3038 3.7617 3.9454 3.9437 3.4194 3.9446 4.2931 3.9717 4.0000 3.7345 3.9187 3.9140 3.8305 3.8989 3.9029 3.9389 1.0384 1.0271 1.0189 1.0069 1.0056 1.0033 1.0078 1.0083 1.0042 1.0057 1.0391 1.0052 1.0057 0.9989 1.0051 1.0048 0.9995 0.9993 1.0230 1.0026 0.9935 1.0001 1.0182 1.0064 1.0074 1.0077 1.0050 1.0066
dispcorr: -0.025410151 hartree
energy: -1038.183576243831
dipole: 0.34080 -0.37288 -0.03208 5.99813 -7.12289 -1.12476 8.71085 -7.71800 0.99286
magnitude: 1.50063 au
magnitude: 3.81429 debye
