program: Orca
programVersion: 5.0.2
elementType: O O O N N C C C C C C C C C C C C C C C C C C H H H H H H H H H H H H H H H H H H H H H H H H H H H H
charge: 0
multiplicity: 1
keywords: wb97x-d3
keywords: def2-TZVPP
keywords: def2/J RIJCOSX
keywords: DEFGRID2
keywords: scfconv7
keywords: smallprint printgap noloewdin
keywords: NOSOSCF
formula: C18H28N2O3
InChI: InChI=1/C18H28N2O3/c1-11(2)16(20-18(22)23-12(3)4)17(21)19-14(6)15-9-7-13(5)8-10-15/h7-12,14,16,19-20H,1-6H3
51 atoms
O  -0.788974 0.116542 -1.224031
O  1.705485 3.793899 -0.912558
O  3.268237 2.281771 -0.300635
N  0.500764 -1.685728 -0.811265
N  1.042927 1.815305 -0.20558
C  1.16075 0.426466 0.15624
C  0.891862 0.152407 1.653696
C  0.199478 -0.387915 -0.700667
C  -0.430249 -2.657487 -1.361522
C  1.885908 0.907373 2.526136
C  -0.542026 0.463914 2.065417
C  -1.602159 -2.887619 -0.432161
C  0.313736 -3.950826 -1.655927
C  2.102096 2.603343 -0.456086
C  -2.907899 -2.801878 -0.899701
C  -1.399539 -3.216275 0.905037
C  -3.786729 -3.386343 1.278702
C  -3.983733 -3.050834 -0.058753
C  -2.475797 -3.462064 1.745023
C  2.703474 4.790846 -1.219472
C  -4.951764 -3.640429 2.188654
C  3.106822 5.532572 0.039041
C  2.083119 5.70385 -2.25508
H  2.18067 0.101881 -0.060416
H  1.06435 -0.918435 1.803053
H  -0.811055 -2.260735 -2.304738
H  1.752263 0.629967 3.572529
H  1.747108 1.987677 2.456593
H  2.917717 0.680382 2.254854
H  -1.273643 -0.162044 1.552608
H  -0.668981 0.288936 3.134434
H  -0.800218 1.507879 1.876475
H  1.292542 -2.039654 -0.292737
H  0.118956 2.169496 -0.404522
H  1.122492 -3.783705 -2.367741
H  0.738945 -4.380894 -0.747303
H  -0.366958 -4.683648 -2.086386
H  -3.088743 -2.541468 -1.936272
H  -0.392837 -3.286786 1.301814
H  -4.99231 -2.978613 -0.449133
H  -2.292622 -3.722384 2.780965
H  3.575304 4.298852 -1.655439
H  -5.697786 -4.278995 1.714873
H  -4.638574 -4.121661 3.114498
H  -5.454187 -2.709264 2.45789
H  2.249861 6.034443 0.491368
H  3.551353 4.869751 0.781488
H  3.847612 6.293491 -0.207849
H  2.803655 6.468795 -2.543083
H  1.196952 6.208762 -1.867135
H  1.804678 5.15581 -3.155573
elementType: O N C H
totalener: -1038.15817043 hartree
nucrepener: 1991.60059445 hartree
electener: -3029.75876488 hartree
oneelecener: -5369.08139319 hartree
twoeener: 2339.32262831 hartree
cpcmener: -0.04767251 hartree
kineticenergy: 1033.40656701 hartree
xcener: -101.565477525011 hartree
chargesum: -0.0000000
charge: -0.553763 -0.345262 -0.571147 -0.195871 -0.245019 0.113826 0.085757 0.267868 0.196399 -0.325032 -0.312088 0.061958 -0.280964 0.531800 -0.193871 -0.276639 -0.021648 -0.169806 -0.166977 0.157353 -0.207072 -0.261121 -0.255899 0.118626 0.049907 0.086437 0.102922 0.087182 0.098535 0.085398 0.099674 0.095113 0.179991 0.172243 0.107628 0.095434 0.098601 0.141862 0.143565 0.143289 0.143736 0.064588 0.099232 0.093154 0.103368 0.088663 0.091879 0.097957 0.091702 0.089831 0.096703
qa: -0.5538 -0.3453 -0.5711 -0.1959 -0.2450 0.1138 0.0858 0.2679 0.1964 -0.3250 -0.3121 0.0620 -0.2810 0.5318 -0.1939 -0.2766 -0.0216 -0.1698 -0.1670 0.1574 -0.2071 -0.2611 -0.2559 0.1186 0.0499 0.0864 0.1029 0.0872 0.0985 0.0854 0.0997 0.0951 0.1800 0.1722 0.1076 0.0954 0.0986 0.1419 0.1436 0.1433 0.1437 0.0646 0.0992 0.0932 0.1034 0.0887 0.0919 0.0980 0.0917 0.0898 0.0967
va: 1.9396 2.0827 1.9214 3.2348 3.2066 3.7763 3.7585 4.2998 3.7627 3.9464 3.9438 3.4331 3.9457 4.2883 3.9968 3.9700 3.7331 3.9169 3.9189 3.8312 3.8990 3.9038 3.9378 1.0390 1.0266 1.0214 1.0056 1.0039 1.0072 1.0082 1.0040 1.0076 1.0058 1.0399 1.0060 0.9991 1.0053 1.0042 1.0059 0.9993 0.9995 1.0235 0.9981 1.0044 0.9939 1.0073 1.0183 1.0063 1.0052 1.0063 1.0079
dispcorr: -0.025308416 hartree
energy: -1038.183478848195
dipole: 1.59673 -1.58071 0.01602 4.67732 -5.96186 -1.28454 8.74224 -7.96906 0.77317
magnitude: 1.49936 au
magnitude: 3.81108 debye
