program: Orca
programVersion: 5.0.2
elementType: O O O N N C C C C C C C C C C C C C C C C C C H H H H H H H H H H H H H H H H H H H H H H H H H H H H
charge: 0
multiplicity: 1
keywords: wb97x-d3
keywords: def2-TZVPP
keywords: def2/J RIJCOSX
keywords: DEFGRID2
keywords: scfconv7
keywords: smallprint printgap noloewdin
keywords: NOSOSCF
formula: C18H28N2O3
InChI: InChI=1/C18H28N2O3/c1-11(2)16(20-18(22)23-12(3)4)17(21)19-14(6)15-9-7-13(5)8-10-15/h7-12,14,16,19-20H,1-6H3
51 atoms
O  -0.804447 0.155736 -1.411849
O  2.194434 3.643757 -1.008259
O  3.351386 1.987754 -0.0029
N  0.341003 -1.642883 -0.665463
N  1.115502 1.8225 -0.386236
C  0.936174 0.522937 0.209844
C  0.319171 0.578935 1.626713
C  0.075604 -0.333475 -0.708531
C  -0.501823 -2.651134 -1.290932
C  1.223078 1.360875 2.572534
C  -1.097176 1.143107 1.646349
C  -1.712332 -2.950086 -0.433775
C  0.326468 -3.893326 -1.579738
C  2.303372 2.449147 -0.423304
C  -2.993497 -2.664665 -0.884005
C  -1.567868 -3.513899 0.833705
C  -3.966859 -3.517524 1.162549
C  -4.105501 -2.947191 -0.097585
C  -2.675248 -3.793648 1.615349
C  3.365131 4.48735 -1.078523
C  -5.159073 -3.843551 2.011334
C  3.579222 5.197629 0.24267
C  3.122425 5.453448 -2.217117
H  1.920421 0.060665 0.299642
H  0.279705 -0.456057 1.981964
H  -0.846008 -2.244189 -2.242674
H  2.240641 0.968336 2.581808
H  0.837806 1.301582 3.591466
H  1.269124 2.41855 2.306006
H  -1.141152 2.146347 1.217377
H  -1.808464 0.514468 1.110149
H  -1.451111 1.219402 2.675363
H  1.037105 -1.966082 -0.008083
H  0.301999 2.2979 -0.748587
H  -0.290824 -4.65163 -2.060205
H  1.153865 -3.658849 -2.249971
H  0.739577 -4.327069 -0.667392
H  -3.131234 -2.220644 -1.862993
H  -0.579508 -3.738098 1.218889
H  -5.095155 -2.716122 -0.473604
H  -2.536176 -4.234761 2.595683
H  4.233641 3.869284 -1.314428
H  -5.043912 -3.460361 3.02593
H  -6.074021 -3.423142 1.595923
H  -5.300917 -4.922831 2.094224
H  3.740586 4.500345 1.064532
H  4.461778 5.83446 0.175755
H  2.72709 5.832674 0.490016
H  2.959405 4.929794 -3.159435
H  3.996802 6.092085 -2.340812
H  2.263056 6.097274 -2.023103
elementType: O N C H
totalener: -1038.15765214 hartree
nucrepener: 1979.90998200 hartree
electener: -3018.06763414 hartree
oneelecener: -5345.65935200 hartree
twoeener: 2327.59171787 hartree
cpcmener: -0.04703856 hartree
kineticenergy: 1033.40047673 hartree
xcener: -101.563580309005 hartree
chargesum: -0.0000000
charge: -0.561671 -0.344804 -0.568157 -0.192888 -0.244903 0.106191 0.089213 0.282915 0.216113 -0.321201 -0.313696 0.003688 -0.286072 0.523641 -0.190757 -0.215824 -0.015904 -0.172568 -0.190279 0.163953 -0.205095 -0.263506 -0.257700 0.113586 0.048964 0.085237 0.098341 0.103345 0.085600 0.090505 0.088635 0.097615 0.179814 0.173257 0.100065 0.106303 0.095170 0.141564 0.145592 0.143586 0.144282 0.065328 0.100447 0.091817 0.102683 0.091209 0.098987 0.088995 0.097058 0.092122 0.089202
qa: -0.5617 -0.3448 -0.5682 -0.1929 -0.2449 0.1062 0.0892 0.2829 0.2161 -0.3212 -0.3137 0.0037 -0.2861 0.5236 -0.1908 -0.2158 -0.0159 -0.1726 -0.1903 0.1640 -0.2051 -0.2635 -0.2577 0.1136 0.0490 0.0852 0.0983 0.1033 0.0856 0.0905 0.0886 0.0976 0.1798 0.1733 0.1001 0.1063 0.0952 0.1416 0.1456 0.1436 0.1443 0.0653 0.1004 0.0918 0.1027 0.0912 0.0990 0.0890 0.0971 0.0921 0.0892
va: 1.9317 2.0813 1.9257 3.2523 3.2081 3.7774 3.7817 4.2847 3.7311 3.9417 3.9547 3.5154 3.9532 4.3040 3.9795 3.9507 3.7293 3.9269 3.9446 3.8214 3.9004 3.8997 3.9402 1.0434 1.0278 1.0233 1.0073 1.0056 1.0030 1.0049 1.0091 1.0042 1.0051 1.0361 1.0045 1.0056 1.0002 1.0081 1.0039 1.0001 0.9992 1.0232 0.9970 1.0052 0.9941 1.0193 1.0063 1.0075 1.0078 1.0049 1.0063
dispcorr: -0.024658266 hartree
energy: -1038.182310401764
dipole: 1.32499 -1.38519 -0.06020 6.25655 -7.31705 -1.06050 8.77833 -7.79937 0.97897
magnitude: 1.44453 au
magnitude: 3.67170 debye
