program: Orca
programVersion: 5.0.2
elementType: O O O N N C C C C C C C C C C C C C C C C C C H H H H H H H H H H H H H H H H H H H H H H H H H H H H
charge: 0
multiplicity: 1
keywords: wb97x-d3
keywords: def2-TZVPP
keywords: def2/J RIJCOSX
keywords: DEFGRID2
keywords: scfconv7
keywords: smallprint printgap noloewdin
keywords: NOSOSCF
formula: C18H28N2O3
InChI: InChI=1/C18H28N2O3/c1-11(2)16(20-18(22)23-12(3)4)17(21)19-14(6)15-9-7-13(5)8-10-15/h7-12,14,16,19-20H,1-6H3
51 atoms
O  0.419574 -0.744033 1.463916
O  2.28445 3.705735 0.760658
O  0.920776 3.451917 -1.020451
N  -1.386828 -0.126183 0.256142
N  1.447967 1.708333 0.343211
C  0.79625 0.674666 -0.429375
C  1.798674 -0.240758 -1.151831
C  -0.077472 -0.137207 0.517944
C  -2.339629 -0.987053 0.942329
C  1.080375 -1.392036 -1.848141
C  2.630827 0.550391 -2.152502
C  -2.229485 -2.41121 0.442533
C  -3.742398 -0.424916 0.7715
C  1.505866 2.992612 -0.054235
C  -1.883717 -3.447116 1.301069
C  -2.456647 -2.712179 -0.898503
C  -2.009531 -5.058864 -0.50188
C  -1.777711 -4.752199 0.836107
C  -2.348354 -4.014076 -1.361358
C  2.389356 5.130631 0.553205
C  -1.922337 -6.471066 -0.999416
C  3.693725 5.55303 1.193349
C  1.193123 5.837236 1.159708
H  0.171916 1.163673 -1.178676
H  2.471364 -0.660838 -0.396262
H  -2.092832 -0.97279 2.005466
H  1.792075 -1.995255 -2.412765
H  0.329418 -1.025335 -2.551983
H  0.581766 -2.063537 -1.147476
H  3.191254 1.35985 -1.684267
H  3.357712 -0.103052 -2.636583
H  2.002722 0.981606 -2.93481
H  -1.703177 0.33463 -0.58519
H  2.033902 1.414725 1.112001
H  -4.462484 -1.056727 1.289439
H  -3.813554 0.579115 1.190507
H  -4.032906 -0.377985 -0.279531
H  -1.693625 -3.235508 2.347053
H  -2.715641 -1.923723 -1.596406
H  -1.503052 -5.541754 1.526045
H  -2.527913 -4.22278 -2.409692
H  2.434982 5.332416 -0.519164
H  -2.853953 -7.010575 -0.814902
H  -1.736221 -6.50709 -2.072613
H  -1.12741 -7.025309 -0.500052
H  3.842289 6.621929 1.042288
H  3.693551 5.364282 2.268051
H  4.544059 5.034447 0.749534
H  1.130462 5.653212 2.233473
H  0.255728 5.524797 0.699534
H  1.28895 6.912941 1.00982
elementType: O N C H
totalener: -1038.15799399 hartree
nucrepener: 1982.89474859 hartree
electener: -3021.05274258 hartree
oneelecener: -5351.66946277 hartree
twoeener: 2330.61672019 hartree
cpcmener: -0.04679249 hartree
kineticenergy: 1033.39836704 hartree
xcener: -101.561554184195 hartree
chargesum: -0.0000000
charge: -0.567688 -0.344237 -0.567351 -0.165336 -0.224988 0.066365 0.083560 0.293537 0.198200 -0.308461 -0.313137 0.023500 -0.284235 0.528522 -0.185586 -0.253120 -0.017266 -0.173675 -0.167978 0.163025 -0.204424 -0.255246 -0.263086 0.095730 0.049177 0.087292 0.099055 0.095949 0.084941 0.094276 0.100560 0.089457 0.180327 0.172457 0.099210 0.108032 0.095260 0.141840 0.143455 0.142738 0.143162 0.064513 0.102606 0.094575 0.097385 0.091768 0.089368 0.096626 0.089205 0.092036 0.098109
qa: -0.5677 -0.3442 -0.5674 -0.1653 -0.2250 0.0664 0.0836 0.2935 0.1982 -0.3085 -0.3131 0.0235 -0.2842 0.5285 -0.1856 -0.2531 -0.0173 -0.1737 -0.1680 0.1630 -0.2044 -0.2552 -0.2631 0.0957 0.0492 0.0873 0.0991 0.0959 0.0849 0.0943 0.1006 0.0895 0.1803 0.1725 0.0992 0.1080 0.0953 0.1418 0.1435 0.1427 0.1432 0.0645 0.1026 0.0946 0.0974 0.0918 0.0894 0.0966 0.0892 0.0920 0.0981
va: 1.9388 2.0828 1.9273 3.2380 3.1785 3.8540 3.7929 4.2295 3.7545 3.9601 3.9451 3.4625 3.9515 4.2997 3.9843 3.9625 3.7255 3.9268 3.9169 3.8247 3.8993 3.9374 3.9028 1.0525 1.0363 1.0210 1.0065 0.9996 1.0075 1.0081 1.0047 1.0020 1.0044 1.0309 1.0049 1.0055 1.0002 1.0064 1.0063 0.9998 0.9996 1.0230 0.9934 1.0028 1.0002 1.0050 1.0062 1.0080 1.0073 1.0189 1.0062
dispcorr: -0.024977493 hartree
energy: -1038.182971481005
dipole: 3.28860 -4.00001 -0.71140 3.19902 -3.21389 -0.01487 -5.93762 5.31613 -0.62149
magnitude: 0.94476 au
magnitude: 2.40138 debye
