program: Orca
programVersion: 5.0.2
elementType: O O O N N C C C C C C C C C C C C C C C C C C H H H H H H H H H H H H H H H H H H H H H H H H H H H H
charge: 0
multiplicity: 1
keywords: wb97x-d3
keywords: def2-TZVPP
keywords: def2/J RIJCOSX
keywords: DEFGRID2
keywords: scfconv7
keywords: smallprint printgap noloewdin
keywords: NOSOSCF
formula: C18H28N2O3
InChI: InChI=1/C18H28N2O3/c1-11(2)16(20-18(22)23-12(3)4)17(21)19-14(6)15-9-7-13(5)8-10-15/h7-12,14,16,19-20H,1-6H3
51 atoms
O  0.991946 -1.273786 -0.22045
O  3.168952 2.927877 0.758221
O  0.994224 3.523401 0.865914
N  -0.724794 -0.628184 1.094338
N  1.647611 1.510369 0.029417
C  0.334277 1.025108 -0.333037
C  0.077188 1.069201 -1.847027
C  0.223927 -0.403403 0.183384
C  -1.044271 -1.959249 1.587947
C  -1.286554 0.468435 -2.172446
C  0.174074 2.493522 -2.377176
C  -1.800472 -2.758743 0.549647
C  -1.822644 -1.838889 2.888683
C  1.864462 2.723509 0.566477
C  -2.993907 -2.282681 0.015561
C  -1.327808 -3.991475 0.114807
C  -3.230758 -4.264865 -1.355775
C  -3.69724 -3.026023 -0.92083
C  -2.033855 -4.735029 -0.82038
C  3.602072 4.193919 1.302061
C  -3.982993 -5.066689 -2.375546
C  3.6866 5.231773 0.201786
C  4.94212 3.93664 1.95543
H  -0.405118 1.656752 0.161934
H  0.849103 0.464893 -2.335098
H  -0.103258 -2.470449 1.799321
H  -1.347285 -0.594134 -1.931477
H  -1.499788 0.564793 -3.237572
H  -2.084472 0.9799 -1.629379
H  -0.005672 2.506092 -3.452974
H  -0.570812 3.142006 -1.911348
H  1.157681 2.933981 -2.212101
H  -1.362982 0.120586 1.322479
H  2.443966 0.950326 -0.240037
H  -2.064011 -2.828937 3.272407
H  -1.237706 -1.317942 3.64704
H  -2.759274 -1.297031 2.746395
H  -3.38507 -1.321358 0.329177
H  -0.398587 -4.380281 0.514926
H  -4.625309 -2.635295 -1.321062
H  -1.644068 -5.693749 -1.142654
H  2.889479 4.516636 2.063693
H  -4.183672 -6.078101 -2.019389
H  -4.93811 -4.604718 -2.621973
H  -3.414533 -5.164038 -3.302023
H  4.395135 4.929131 -0.5710
H  2.719655 5.413098 -0.267695
H  4.030547 6.178503 0.619087
H  4.864382 3.193537 2.749574
H  5.311096 4.859896 2.401533
H  5.683865 3.595895 1.231188
elementType: O N C H
totalener: -1038.15822833 hartree
nucrepener: 1979.80065613 hartree
electener: -3017.95888446 hartree
oneelecener: -5345.47215406 hartree
twoeener: 2327.51326960 hartree
cpcmener: -0.04688400 hartree
kineticenergy: 1033.41207313 hartree
xcener: -101.564457256411 hartree
chargesum: -0.0000000
charge: -0.569038 -0.343202 -0.567605 -0.164720 -0.223948 0.064124 0.086922 0.293094 0.188354 -0.310709 -0.312782 0.048111 -0.281243 0.530827 -0.269976 -0.189477 -0.022693 -0.157741 -0.176689 0.160959 -0.205466 -0.261755 -0.256003 0.096246 0.047513 0.087903 0.089179 0.098133 0.096461 0.100098 0.089021 0.092722 0.180798 0.171893 0.098863 0.108158 0.095552 0.142389 0.141804 0.143578 0.142859 0.064962 0.100859 0.091880 0.102711 0.088928 0.091432 0.098495 0.097179 0.091787 0.089252
qa: -0.5690 -0.3432 -0.5676 -0.1647 -0.2239 0.0641 0.0869 0.2931 0.1884 -0.3107 -0.3128 0.0481 -0.2812 0.5308 -0.2700 -0.1895 -0.0227 -0.1577 -0.1767 0.1610 -0.2055 -0.2618 -0.2560 0.0962 0.0475 0.0879 0.0892 0.0981 0.0965 0.1001 0.0890 0.0927 0.1808 0.1719 0.0989 0.1082 0.0956 0.1424 0.1418 0.1436 0.1429 0.0650 0.1009 0.0919 0.1027 0.0889 0.0914 0.0985 0.0972 0.0918 0.0893
va: 1.9367 2.0816 1.9270 3.2385 3.1809 3.8646 3.7834 4.2201 3.7672 3.9564 3.9454 3.4380 3.9489 4.2969 3.9667 3.9897 3.7352 3.9068 3.9230 3.8271 3.8997 3.9014 3.9378 1.0511 1.0378 1.0210 1.0072 1.0063 1.0006 1.0053 1.0031 1.0076 1.0041 1.0325 1.0049 1.0058 0.9997 1.0070 1.0050 0.9994 0.9993 1.0234 0.9964 1.0055 0.9947 1.0074 1.0185 1.0066 1.0077 1.0050 1.0065
dispcorr: -0.024928680 hartree
energy: -1038.183157013935
dipole: -0.99192 0.14866 -0.84326 7.84219 -7.75985 0.08234 -4.87743 5.27416 0.39673
magnitude: 0.93556 au
magnitude: 2.37799 debye
