program: Orca
programVersion: 5.0.2
elementType: O O O N N C C C C C C C C C C C C C C C C C C H H H H H H H H H H H H H H H H H H H H H H H H H H H H
charge: 0
multiplicity: 1
keywords: wb97x-d3
keywords: def2-TZVPP
keywords: def2/J RIJCOSX
keywords: DEFGRID2
keywords: scfconv7
keywords: smallprint printgap noloewdin
keywords: NOSOSCF
formula: C18H28N2O3
InChI: InChI=1/C18H28N2O3/c1-11(2)16(20-18(22)23-12(3)4)17(21)19-14(6)15-9-7-13(5)8-10-15/h7-12,14,16,19-20H,1-6H3
51 atoms
O  1.830428 -0.575818 -2.016403
O  0.411958 2.160265 -0.192373
O  0.478161 2.5953 2.021636
N  0.910596 -1.04695 -0.001368
N  2.019321 1.25885 1.036658
C  2.624825 0.672533 -0.139564
C  4.00539 0.089199 0.233312
C  1.734069 -0.373552 -0.80728
C  0.02688 -2.125467 -0.413517
C  3.93101 -1.135145 1.140412
C  4.848913 -0.206852 -1.00062
C  -1.416689 -1.744377 -0.17293
C  0.405821 -3.41645 0.302064
C  0.927777 2.05159 1.027654
C  -2.315129 -1.66379 -1.227985
C  -1.879326 -1.457529 1.111158
C  -4.106226 -1.01646 0.266887
C  -3.641489 -1.306701 -1.01111
C  -3.199389 -1.098139 1.324841
C  -0.78143 2.95475 -0.385404
C  -5.535272 -0.633814 0.512238
C  -2.010471 2.164383 0.014935
C  -0.795325 3.332954 -1.850052
H  2.797226 1.448088 -0.890769
H  4.507935 0.891031 0.784944
H  0.169142 -2.265753 -1.484445
H  4.929883 -1.391206 1.495449
H  3.541944 -2.007466 0.611157
H  3.309732 -0.976302 2.023949
H  4.470357 -1.061103 -1.563363
H  4.894386 0.649838 -1.674522
H  5.870017 -0.444232 -0.700501
H  0.922618 -0.8212 0.983317
H  2.498954 1.176355 1.921193
H  0.324271 -3.310955 1.385202
H  -0.250692 -4.229879 -0.006192
H  1.431703 -3.701412 0.066243
H  -1.979288 -1.880392 -2.235585
H  -1.204327 -1.509694 1.958556
H  -4.32062 -1.248348 -1.853619
H  -3.532445 -0.873041 2.331507
H  -0.702252 3.859335 0.22095
H  -6.069037 -1.418754 1.051506
H  -5.607695 0.271551 1.116136
H  -6.068192 -0.456053 -0.421058
H  -1.996662 1.881326 1.066758
H  -2.901091 2.771972 -0.148098
H  -2.107511 1.260713 -0.589361
H  -0.871102 2.451695 -2.489297
H  0.098677 3.890489 -2.130585
H  -1.658503 3.96621 -2.053133
elementType: O N C H
totalener: -1038.15424448 hartree
nucrepener: 2109.39970802 hartree
electener: -3147.55395250 hartree
oneelecener: -5604.17035407 hartree
twoeener: 2456.61640157 hartree
cpcmener: -0.05026491 hartree
kineticenergy: 1033.38714007 hartree
xcener: -101.564305531834 hartree
chargesum: -0.0000000
charge: -0.564161 -0.304629 -0.557608 -0.169397 -0.238090 0.109788 0.077676 0.246864 0.206314 -0.316802 -0.320512 -0.035777 -0.297778 0.498273 -0.159985 -0.182373 -0.014381 -0.159367 -0.213866 0.154368 -0.205798 -0.274459 -0.263360 0.114563 0.058729 0.067580 0.108278 0.085575 0.098633 0.082914 0.099608 0.100622 0.180866 0.177847 0.097340 0.105257 0.103010 0.140991 0.144504 0.141106 0.141776 0.075010 0.104320 0.100055 0.092075 0.098857 0.112170 0.068256 0.091208 0.098790 0.095119
qa: -0.5642 -0.3046 -0.5576 -0.1694 -0.2381 0.1098 0.0777 0.2469 0.2063 -0.3168 -0.3205 -0.0358 -0.2978 0.4983 -0.1600 -0.1824 -0.0144 -0.1594 -0.2139 0.1544 -0.2058 -0.2745 -0.2634 0.1146 0.0587 0.0676 0.1083 0.0856 0.0986 0.0829 0.0996 0.1006 0.1809 0.1778 0.0973 0.1053 0.1030 0.1410 0.1445 0.1411 0.1418 0.0750 0.1043 0.1001 0.0921 0.0989 0.1122 0.0683 0.0912 0.0988 0.0951
va: 1.9502 2.0929 1.9434 3.2075 3.1614 3.8197 3.8087 4.1901 3.7142 3.9507 3.9487 3.6029 3.9559 4.3371 3.9239 3.8972 3.6863 3.8905 3.9078 3.8043 3.9013 3.8952 3.9387 1.0328 1.0167 1.0601 1.0055 1.0037 1.0062 1.0112 1.0023 1.0016 1.0134 1.0175 1.0005 1.0069 1.0036 1.0032 1.0026 1.0012 1.0011 1.0248 0.9948 0.9965 1.0052 1.0178 1.0101 1.0082 1.0049 1.0084 1.0054
dispcorr: -0.028940809 hartree
energy: -1038.183185292766
dipole: 0.61546 -0.68947 -0.07401 -3.45897 2.75649 -0.70248 -0.92840 2.02826 1.09986
magnitude: 1.30716 au
magnitude: 3.32253 debye
