program: Orca
programVersion: 5.0.2
elementType: O O O N N C C C C C C C C C C C C C C C C C C H H H H H H H H H H H H H H H H H H H H H H H H H H H H
charge: 0
multiplicity: 1
keywords: wb97x-d3
keywords: def2-TZVPP
keywords: def2/J RIJCOSX
keywords: DEFGRID2
keywords: scfconv7
keywords: smallprint printgap noloewdin
keywords: NOSOSCF
formula: C18H28N2O3
InChI: InChI=1/C18H28N2O3/c1-11(2)16(20-18(22)23-12(3)4)17(21)19-14(6)15-9-7-13(5)8-10-15/h7-12,14,16,19-20H,1-6H3
51 atoms
O  1.945088 -1.611652 -1.703694
O  0.086863 2.713476 0.324988
O  0.385195 1.472235 -1.53887
N  1.009409 -1.35724 0.343205
N  1.801766 1.316174 0.213344
C  2.614339 0.295619 -0.40731
C  3.85225 0.01445 0.462389
C  1.808496 -0.981021 -0.664361
C  0.085876 -2.479681 0.295389
C  4.651708 -1.173949 -0.059999
C  4.743367 1.251173 0.534626
C  -1.334954 -1.966705 0.195435
C  0.314987 -3.401234 1.48493
C  0.721962 1.813813 -0.421903
C  -2.023859 -2.032899 -1.011642
C  -1.972036 -1.376638 1.282773
C  -3.946286 -0.924383 -0.044633
C  -3.308288 -1.522511 -1.129142
C  -3.256852 -0.866087 1.163414
C  -1.088001 3.356698 -0.216616
C  -5.316105 -0.331786 -0.189238
C  -1.261811 4.634556 0.57547
C  -2.292224 2.441825 -0.110303
H  2.959303 0.637997 -1.388217
H  3.505269 -0.226462 1.474428
H  0.312098 -3.034517 -0.614906
H  5.562154 -1.292883 0.528618
H  4.949944 -1.030538 -1.100459
H  4.105635 -2.115092 0.008443
H  4.233747 2.121851 0.949317
H  5.61099 1.057396 1.166885
H  5.111523 1.523655 -0.457037
H  0.929858 -0.742831 1.140944
H  2.027468 1.642376 1.141279
H  0.182023 -2.884926 2.437017
H  -0.381363 -4.239648 1.459306
H  1.328194 -3.803827 1.462565
H  -1.54962 -2.487106 -1.874206
H  -1.468387 -1.306759 2.24032
H  -3.819776 -1.586824 -2.083025
H  -3.727896 -0.408335 2.025683
H  -0.903437 3.605478 -1.26464
H  -6.009143 -1.027444 -0.664663
H  -5.736669 -0.050074 0.775673
H  -5.290724 0.566674 -0.810179
H  -2.118027 5.188844 0.190891
H  -1.44403 4.430669 1.632229
H  -0.386849 5.280488 0.492991
H  -2.166224 1.529566 -0.691888
H  -3.175434 2.954395 -0.494176
H  -2.489558 2.169362 0.927936
elementType: O N C H
totalener: -1038.16395737 hartree
nucrepener: 2084.10377868 hartree
electener: -3122.26773606 hartree
oneelecener: -5554.05317157 hartree
twoeener: 2431.78543551 hartree
cpcmener: -0.04548830 hartree
kineticenergy: 1033.39915095 hartree
xcener: -101.560479798330 hartree
chargesum: 0.0000000
charge: -0.515216 -0.335170 -0.521400 -0.168113 -0.248224 0.084751 0.043704 0.270419 0.182854 -0.305052 -0.287356 -0.032110 -0.283034 0.500901 -0.152597 -0.158799 -0.013131 -0.166413 -0.228482 0.177521 -0.209457 -0.257521 -0.268750 0.101965 0.055913 0.074405 0.092893 0.095178 0.094055 0.090385 0.094158 0.089055 0.165875 0.173961 0.089366 0.100529 0.101322 0.137943 0.143424 0.137236 0.137860 0.067001 0.106809 0.092033 0.100970 0.091294 0.088205 0.096907 0.082060 0.101850 0.088022
qa: -0.5152 -0.3352 -0.5214 -0.1681 -0.2482 0.0848 0.0437 0.2704 0.1829 -0.3051 -0.2874 -0.0321 -0.2830 0.5009 -0.1526 -0.1588 -0.0131 -0.1664 -0.2285 0.1775 -0.2095 -0.2575 -0.2687 0.1020 0.0559 0.0744 0.0929 0.0952 0.0941 0.0904 0.0942 0.0891 0.1659 0.1740 0.0894 0.1005 0.1013 0.1379 0.1434 0.1372 0.1379 0.0670 0.1068 0.0920 0.1010 0.0913 0.0882 0.0969 0.0821 0.1019 0.0880
va: 2.0041 2.0880 1.9871 3.1832 3.1569 3.7652 3.8481 4.1804 3.7317 3.9549 3.9405 3.6073 3.9640 4.3307 3.9427 3.9044 3.6746 3.9107 3.9125 3.8477 3.8927 3.9427 3.8845 1.0365 1.0220 1.0498 1.0044 1.0057 1.0094 1.0107 1.0049 1.0022 1.0280 1.0217 1.0027 1.0054 1.0055 1.0067 1.0004 1.0013 1.0036 1.0209 0.9983 1.0052 0.9933 1.0053 1.0064 1.0084 1.0239 1.0082 1.0065
dispcorr: -0.027397040 hartree
energy: -1038.191354412900
dipole: 0.68307 -1.06981 -0.38673 5.44302 -4.28225 1.16077 8.80369 -5.68066 3.12303
magnitude: 3.35415 au
magnitude: 8.52556 debye
