program: Orca
programVersion: 5.0.2
elementType: O O O N N C C C C C C C C C C C C C C C C C C H H H H H H H H H H H H H H H H H H H H H H H H H H H H
charge: 0
multiplicity: 1
keywords: wb97x-d3
keywords: def2-TZVPP
keywords: def2/J RIJCOSX
keywords: DEFGRID2
keywords: scfconv7
keywords: smallprint printgap noloewdin
keywords: NOSOSCF
formula: C18H28N2O3
InChI: InChI=1/C18H28N2O3/c1-11(2)16(20-18(22)23-12(3)4)17(21)19-14(6)15-9-7-13(5)8-10-15/h7-12,14,16,19-20H,1-6H3
51 atoms
O  1.88475 -1.631516 -1.676373
O  0.175306 2.764727 0.414261
O  0.264728 1.459696 -1.431755
N  1.008441 -1.273028 0.381487
N  1.861619 1.361269 0.166245
C  2.61583 0.322201 -0.492116
C  3.913217 0.06069 0.293026
C  1.785466 -0.953715 -0.662212
C  0.079371 -2.392357 0.410774
C  4.662778 -1.158879 -0.232144
C  4.814081 1.291805 0.244911
C  -1.332918 -1.895846 0.162346
C  0.258648 -3.169507 1.704466
C  0.721198 1.837877 -0.370374
C  -1.726931 -1.590998 -1.140872
C  -2.251226 -1.691374 1.184527
C  -3.924846 -0.915116 -0.38574
C  -2.998015 -1.112814 -1.409784
C  -3.526591 -1.208384 0.913117
C  -1.123588 3.289778 0.070041
C  -5.306327 -0.415896 -0.687158
C  -1.247281 4.602528 0.811989
C  -2.204637 2.297858 0.453546
H  2.887967 0.63881 -1.50425
H  3.638504 -0.133341 1.336769
H  0.354041 -3.045676 -0.417827
H  5.627689 -1.241927 0.26744
H  4.852562 -1.085083 -1.303865
H  4.128592 -2.08983 -0.046704
H  4.345998 2.18137 0.667834
H  5.729998 1.114327 0.809739
H  5.098454 1.524482 -0.783387
H  0.949579 -0.619828 1.149941
H  2.171134 1.715184 1.059063
H  -0.439849 -4.004519 1.758459
H  1.269315 -3.574018 1.758229
H  0.10576 -2.545233 2.586428
H  -1.03075 -1.738791 -1.958483
H  -1.988574 -1.910819 2.2119
H  -3.275794 -0.890272 -2.433884
H  -4.220932 -1.058895 1.732015
H  -1.157897 3.479259 -1.005625
H  -5.816093 -0.074709 0.213497
H  -5.286326 0.413305 -1.39579
H  -5.921913 -1.200453 -1.132637
H  -0.460969 5.301276 0.523645
H  -2.204287 5.06814 0.577848
H  -1.201769 4.458251 1.892823
H  -2.181678 2.082342 1.5233
H  -2.107534 1.358861 -0.090286
H  -3.185846 2.711303 0.216552
elementType: O N C H
totalener: -1038.16391140 hartree
nucrepener: 2092.11346964 hartree
electener: -3130.27738104 hartree
oneelecener: -5570.19107071 hartree
twoeener: 2439.91368967 hartree
cpcmener: -0.04310029 hartree
kineticenergy: 1033.40703367 hartree
xcener: -101.563951572728 hartree
chargesum: -0.0000000
charge: -0.519098 -0.334449 -0.517233 -0.157069 -0.245124 0.069619 0.045970 0.289626 0.179949 -0.304760 -0.287855 -0.027763 -0.300698 0.498944 -0.204269 -0.155405 -0.039573 -0.138907 -0.184308 0.173225 -0.214297 -0.261350 -0.227764 0.102720 0.055329 0.090339 0.092126 0.094685 0.094113 0.090563 0.093587 0.089222 0.161328 0.173779 0.108989 0.102283 0.088121 0.137754 0.142627 0.136564 0.136484 0.067199 0.092019 0.098467 0.107442 0.096915 0.091059 0.088377 0.088710 0.041666 0.100122
qa: -0.5191 -0.3344 -0.5172 -0.1571 -0.2451 0.0696 0.0460 0.2896 0.1799 -0.3048 -0.2879 -0.0278 -0.3007 0.4989 -0.2043 -0.1554 -0.0396 -0.1389 -0.1843 0.1732 -0.2143 -0.2614 -0.2278 0.1027 0.0553 0.0903 0.0921 0.0947 0.0941 0.0906 0.0936 0.0892 0.1613 0.1738 0.1090 0.1023 0.0881 0.1378 0.1426 0.1366 0.1365 0.0672 0.0920 0.0985 0.1074 0.0969 0.0911 0.0884 0.0887 0.0417 0.1001
va: 1.9976 2.0881 1.9911 3.1670 3.1540 3.7982 3.8395 4.1479 3.7116 3.9563 3.9405 3.6381 3.9749 4.3345 3.9199 3.9194 3.7051 3.8655 3.9222 3.8504 3.8956 3.9484 3.8902 1.0345 1.0229 1.0384 1.0049 1.0074 1.0082 1.0105 1.0051 1.0020 1.0318 1.0219 1.0020 1.0062 0.9999 1.0220 0.9976 1.0009 1.0031 1.0208 1.0047 0.9981 0.9944 1.0083 1.0051 1.0062 1.0092 1.0360 1.0094
dispcorr: -0.027855891 hartree
energy: -1038.191767287970
dipole: 0.97477 -1.18899 -0.21422 5.13942 -3.97359 1.16583 9.04168 -5.96416 3.07752
magnitude: 3.29791 au
magnitude: 8.38262 debye
