program: Orca
programVersion: 5.0.2
elementType: O O O N N C C C C C C C C C C C C C C C C C C H H H H H H H H H H H H H H H H H H H H H H H H H H H H
charge: 0
multiplicity: 1
keywords: wb97x-d3
keywords: def2-TZVPP
keywords: def2/J RIJCOSX
keywords: DEFGRID2
keywords: scfconv7
keywords: smallprint printgap noloewdin
keywords: NOSOSCF
formula: C18H28N2O3
InChI: InChI=1/C18H28N2O3/c1-11(2)16(20-18(22)23-12(3)4)17(21)19-14(6)15-9-7-13(5)8-10-15/h7-12,14,16,19-20H,1-6H3
51 atoms
O  1.875658 -1.780408 -1.663585
O  -0.179739 2.330942 0.318387
O  0.126798 1.036436 -1.507439
N  1.164342 -1.494152 0.46877
N  1.726887 1.227377 0.076816
C  2.57415 0.214774 -0.514481
C  3.867017 0.074556 0.305923
C  1.826381 -1.11808 -0.637612
C  0.151593 -2.540744 0.504083
C  4.703791 -1.106669 -0.171481
C  4.684974 1.360432 0.240667
C  -1.209509 -1.888072 0.368487
C  0.321226 -3.388625 1.754268
C  0.517664 1.501972 -0.454294
C  -1.805973 -1.776599 -0.885072
C  -1.8445 -1.288783 1.450994
C  -3.627729 -0.471364 0.029531
C  -2.993447 -1.081451 -1.051641
C  -3.035762 -0.595192 1.282712
C  -1.507917 2.709442 -0.104658
C  -4.898658 0.301797 -0.159132
C  -1.436092 3.85376 -1.095149
C  -2.264686 3.0772 1.153039
H  2.845309 0.503762 -1.534572
H  3.584911 -0.107165 1.350144
H  0.318789 -3.175124 -0.366307
H  5.650466 -1.13423 0.36939
H  4.935321 -1.030152 -1.235765
H  4.213408 -2.065669 -0.001037
H  4.99007 1.575575 -0.78581
H  4.142234 2.229588 0.614335
H  5.590386 1.264677 0.841602
H  1.136911 -0.841002 1.239577
H  1.959769 1.597927 0.986594
H  0.263496 -2.795984 2.668485
H  -0.449675 -4.157687 1.804503
H  1.291747 -3.885098 1.7431
H  -1.327641 -2.228008 -1.746706
H  -1.413155 -1.349507 2.443259
H  -3.428989 -1.003639 -2.041517
H  -3.507933 -0.137068 2.144085
H  -1.987921 1.845788 -0.570591
H  -5.217723 0.780921 0.76608
H  -4.783111 1.081588 -0.914135
H  -5.713802 -0.343217 -0.493419
H  -0.947332 4.72595 -0.656907
H  -0.899486 3.577211 -2.002796
H  -2.444185 4.148788 -1.389067
H  -2.276115 2.254786 1.869038
H  -3.299419 3.309919 0.900433
H  -1.834966 3.953988 1.641457
elementType: O N C H
totalener: -1038.16256913 hartree
nucrepener: 2126.51425196 hartree
electener: -3164.67682109 hartree
oneelecener: -5638.96073433 hartree
twoeener: 2474.28391324 hartree
cpcmener: -0.04550781 hartree
kineticenergy: 1033.40145861 hartree
xcener: -101.561369616997 hartree
chargesum: -0.0000000
charge: -0.506808 -0.336461 -0.517228 -0.165007 -0.248170 0.095479 0.041615 0.255560 0.180360 -0.304276 -0.287660 0.000576 -0.283659 0.488819 -0.204530 -0.167950 -0.035291 -0.135273 -0.207470 0.180925 -0.220518 -0.267758 -0.274798 0.101019 0.054683 0.082741 0.093450 0.096194 0.093879 0.088990 0.091324 0.094282 0.163601 0.174224 0.086972 0.101151 0.101504 0.133276 0.144857 0.136906 0.139795 0.047690 0.092388 0.100688 0.114997 0.092308 0.097042 0.096911 0.098918 0.095066 0.104668
qa: -0.5068 -0.3365 -0.5172 -0.1650 -0.2482 0.0955 0.0416 0.2556 0.1804 -0.3043 -0.2877 0.0006 -0.2837 0.4888 -0.2045 -0.1680 -0.0353 -0.1353 -0.2075 0.1809 -0.2205 -0.2678 -0.2748 0.1010 0.0547 0.0827 0.0934 0.0962 0.0939 0.0890 0.0913 0.0943 0.1636 0.1742 0.0870 0.1012 0.1015 0.1333 0.1449 0.1369 0.1398 0.0477 0.0924 0.1007 0.1150 0.0923 0.0970 0.0969 0.0989 0.0951 0.1047
va: 2.0101 2.0786 1.9817 3.1684 3.1634 3.7460 3.8599 4.1909 3.7571 3.9526 3.9403 3.5721 3.9651 4.3439 3.9208 3.9281 3.6608 3.8777 3.8997 3.7954 3.8911 3.9298 3.9260 1.0332 1.0211 1.0393 1.0042 1.0052 1.0103 1.0021 1.0106 1.0047 1.0282 1.0207 1.0027 1.0046 1.0058 1.0146 0.9987 0.9996 1.0004 1.0310 1.0043 0.9946 0.9969 1.0078 1.0162 1.0057 1.0070 1.0042 1.0090
dispcorr: -0.029438062 hartree
energy: -1038.192007193662
dipole: 1.40851 -1.65797 -0.24946 7.72962 -6.38863 1.34099 7.63091 -4.58206 3.04885
magnitude: 3.34005 au
magnitude: 8.48974 debye
