program: Orca
programVersion: 5.0.2
elementType: O O O N N C C C C C C C C C C C C C C C C C C H H H H H H H H H H H H H H H H H H H H H H H H H H H H
charge: 0
multiplicity: 1
keywords: wb97x-d3
keywords: def2-TZVPP
keywords: def2/J RIJCOSX
keywords: DEFGRID2
keywords: scfconv7
keywords: smallprint printgap noloewdin
keywords: NOSOSCF
formula: C18H28N2O3
InChI: InChI=1/C18H28N2O3/c1-11(2)16(20-18(22)23-12(3)4)17(21)19-14(6)15-9-7-13(5)8-10-15/h7-12,14,16,19-20H,1-6H3
51 atoms
O  1.554052 -1.706407 -1.586633
O  0.387121 2.986201 0.589164
O  0.00071 1.658705 -1.198183
N  0.987783 -1.120324 0.517257
N  1.870512 1.432592 0.054962
C  2.412722 0.377412 -0.769411
C  3.900925 0.157587 -0.430001
C  1.597487 -0.911585 -0.65643
C  0.120456 -2.254778 0.775918
C  4.132437 -0.413873 0.965106
C  4.600594 -0.693308 -1.482291
C  -1.28547 -1.992644 0.281039
C  0.144159 -2.579428 2.263314
C  0.690087 2.007119 -0.260097
C  -1.904794 -2.865692 -0.602808
C  -1.997968 -0.877133 0.7156
C  -3.922568 -1.528536 -0.601634
C  -3.205466 -2.638589 -1.035945
C  -3.295176 -0.652847 0.284531
C  -0.804922 3.766901 0.352386
C  -5.313629 -1.257968 -1.092549
C  -0.616259 5.052667 1.12821
C  -2.046268 3.011951 0.786305
H  2.357315 0.674448 -1.820873
H  4.350607 1.156191 -0.467774
H  0.523536 -3.110328 0.231469
H  5.198522 -0.405523 1.196254
H  3.793094 -1.448367 1.040758
H  3.634035 0.158156 1.750031
H  4.248892 -1.725111 -1.479509
H  4.458058 -0.292206 -2.486819
H  5.673306 -0.715727 -1.286625
H  1.027985 -0.394368 1.217345
H  2.439011 1.838728 0.783334
H  -0.23018 -1.747332 2.863159
H  -0.483061 -3.445796 2.470553
H  1.157717 -2.809611 2.594746
H  -1.368235 -3.738061 -0.958157
H  -1.542787 -0.172494 1.403392
H  -3.665018 -3.336325 -1.726551
H  -3.831291 0.218487 0.643768
H  -0.867521 3.996655 -0.714585
H  -5.302356 -0.581054 -1.950078
H  -5.814391 -2.172486 -1.409896
H  -5.927748 -0.788659 -0.323497
H  0.288978 5.578351 0.821576
H  -1.461209 5.716402 0.945268
H  -0.562333 4.869426 2.203016
H  -2.207865 2.113632 0.193363
H  -2.922035 3.649123 0.656159
H  -1.991968 2.732928 1.840342
elementType: O N C H
totalener: -1038.16424578 hartree
nucrepener: 2073.55504028 hartree
electener: -3111.71928605 hartree
oneelecener: -5533.16173974 hartree
twoeener: 2421.44245369 hartree
cpcmener: -0.04559352 hartree
kineticenergy: 1033.40352485 hartree
xcener: -101.562097805638 hartree
chargesum: -0.0000000
charge: -0.518624 -0.334663 -0.517709 -0.179159 -0.241556 0.112675 0.062552 0.241276 0.162801 -0.309213 -0.313285 0.041093 -0.284186 0.495314 -0.177731 -0.244564 -0.019295 -0.166398 -0.182731 0.173312 -0.209668 -0.258983 -0.275513 0.110472 0.056737 0.081229 0.105824 0.085806 0.093803 0.085232 0.097851 0.096417 0.173159 0.173743 0.093260 0.100251 0.104386 0.138189 0.148973 0.138762 0.146475 0.067166 0.103928 0.093447 0.095284 0.096837 0.091548 0.088317 0.081651 0.103906 0.091604
qa: -0.5186 -0.3347 -0.5177 -0.1792 -0.2416 0.1127 0.0626 0.2413 0.1628 -0.3092 -0.3133 0.0411 -0.2842 0.4953 -0.1777 -0.2446 -0.0193 -0.1664 -0.1827 0.1733 -0.2097 -0.2590 -0.2755 0.1105 0.0567 0.0812 0.1058 0.0858 0.0938 0.0852 0.0979 0.0964 0.1732 0.1737 0.0933 0.1003 0.1044 0.1382 0.1490 0.1388 0.1465 0.0672 0.1039 0.0934 0.0953 0.0968 0.0915 0.0883 0.0817 0.1039 0.0916
va: 2.0069 2.0856 1.9877 3.1720 3.1661 3.8061 3.8426 4.1978 3.7906 3.9466 3.9509 3.5139 3.9493 4.3276 3.9889 3.9604 3.7638 3.9264 3.9310 3.8351 3.9034 3.9449 3.8865 1.0373 1.0165 1.0307 1.0051 1.0082 1.0070 1.0126 1.0032 1.0022 1.0226 1.0225 0.9994 1.0064 1.0053 1.0054 0.9948 1.0010 0.9959 1.0182 0.9924 1.0026 1.0010 1.0079 1.0055 1.0060 1.0248 1.0093 1.0048
dispcorr: -0.026978689 hartree
energy: -1038.191224467393
dipole: 1.73891 -1.25253 0.48638 5.03685 -3.44895 1.58790 8.62490 -5.88969 2.73521
magnitude: 3.19990 au
magnitude: 8.13350 debye
