program: Orca
programVersion: 5.0.2
elementType: O O O N N C C C C C C C C C C C C C C C C C C H H H H H H H H H H H H H H H H H H H H H H H H H H H H
charge: 0
multiplicity: 1
keywords: wb97x-d3
keywords: def2-TZVPP
keywords: def2/J RIJCOSX
keywords: DEFGRID2
keywords: scfconv7
keywords: smallprint printgap noloewdin
keywords: NOSOSCF
formula: C18H28N2O3
InChI: InChI=1/C18H28N2O3/c1-11(2)16(20-18(22)23-12(3)4)17(21)19-14(6)15-9-7-13(5)8-10-15/h7-12,14,16,19-20H,1-6H3
51 atoms
O  2.238229 -1.702132 -1.631723
O  0.210506 2.855861 0.247918
O  0.338668 1.539337 -1.585429
N  0.980834 -1.178467 0.174488
N  1.868975 1.405349 0.077481
C  2.670216 0.403767 -0.58503
C  4.012577 0.24335 0.156431
C  1.930863 -0.927558 -0.733503
C  0.118907 -2.349706 0.166026
C  3.866886 -0.330492 1.563038
C  5.019857 -0.56664 -0.650287
C  -1.329274 -1.911598 0.148043
C  0.448047 -3.277487 1.328816
C  0.764309 1.910767 -0.509904
C  -2.095174 -2.062343 -1.00155
C  -1.926745 -1.324946 1.26202
C  -4.017678 -1.054457 0.069779
C  -3.418823 -1.643599 -1.039096
C  -3.246703 -0.904655 1.222067
C  -1.049635 3.426866 -0.162526
C  -5.43509 -0.566904 0.024596
C  -1.169345 4.739107 0.581413
C  -2.187881 2.47569 0.154401
H  2.894753 0.730778 -1.605098
H  4.410382 1.260817 0.242852
H  0.321208 -2.880742 -0.764143
H  4.827214 -0.294633 2.07906
H  3.54906 -1.374648 1.54346
H  3.155662 0.221674 2.18069
H  5.124376 -0.186513 -1.667834
H  6.00122 -0.511329 -0.177336
H  4.748584 -1.620726 -0.711411
H  0.808571 -0.486136 0.889278
H  2.209669 1.835685 0.924369
H  1.476257 -3.633021 1.252137
H  0.336468 -2.778879 2.292897
H  -0.208882 -4.147908 1.323242
H  -1.655416 -2.515953 -1.882482
H  -1.362123 -1.191887 2.178203
H  -3.992647 -1.778774 -1.948748
H  -3.68566 -0.450643 2.103398
H  -1.018732 3.623609 -1.237002
H  -5.967628 -0.790138 0.949799
H  -5.473541 0.516378 -0.112289
H  -5.989634 -1.017509 -0.798245
H  -1.205406 4.587096 1.661873
H  -0.336824 5.4061 0.354095
H  -2.08814 5.245638 0.28568
H  -2.224854 2.248139 1.221291
H  -2.10685 1.539604 -0.397341
H  -3.137936 2.935201 -0.121752
elementType: O N C H
totalener: -1038.16399280 hartree
nucrepener: 2080.70134049 hartree
electener: -3118.86533329 hartree
oneelecener: -5547.05333877 hartree
twoeener: 2428.18800548 hartree
cpcmener: -0.04255292 hartree
kineticenergy: 1033.39357889 hartree
xcener: -101.560670693570 hartree
chargesum: 0.0000000
charge: -0.522551 -0.336222 -0.518518 -0.168217 -0.244450 0.095562 0.064769 0.256893 0.178229 -0.312950 -0.312767 -0.031274 -0.290421 0.499774 -0.150666 -0.167425 -0.000014 -0.158750 -0.240401 0.173397 -0.203396 -0.258382 -0.259890 0.110117 0.058203 0.068371 0.106278 0.086610 0.093625 0.097544 0.096842 0.084444 0.174277 0.172587 0.102616 0.090176 0.103444 0.139131 0.144798 0.138622 0.138193 0.067373 0.098205 0.100638 0.094096 0.088437 0.097039 0.091293 0.086987 0.075164 0.102560
qa: -0.5226 -0.3362 -0.5185 -0.1682 -0.2444 0.0956 0.0648 0.2569 0.1782 -0.3130 -0.3128 -0.0313 -0.2904 0.4998 -0.1507 -0.1674 -0.0000 -0.1588 -0.2404 0.1734 -0.2034 -0.2584 -0.2599 0.1101 0.0582 0.0684 0.1063 0.0866 0.0936 0.0975 0.0968 0.0844 0.1743 0.1726 0.1026 0.0902 0.1034 0.1391 0.1448 0.1386 0.1382 0.0674 0.0982 0.1006 0.0941 0.0884 0.0970 0.0913 0.0870 0.0752 0.1026
va: 2.0071 2.0850 1.9911 3.1991 3.1577 3.8225 3.8363 4.2013 3.7294 3.9493 3.9543 3.6124 3.9531 4.3287 3.9486 3.8917 3.6853 3.9135 3.9252 3.8489 3.8976 3.9436 3.8868 1.0359 1.0153 1.0605 1.0051 1.0051 1.0074 1.0040 1.0024 1.0116 1.0201 1.0233 1.0040 1.0030 1.0068 1.0031 1.0008 1.0011 1.0027 1.0206 0.9993 0.9930 1.0041 1.0060 1.0084 1.0054 1.0066 1.0233 1.0082
dispcorr: -0.027551495 hartree
energy: -1038.191544295200
dipole: -0.44020 -0.10708 -0.54728 3.75352 -2.27642 1.47709 10.20573 -7.33241 2.87331
magnitude: 3.27677 au
magnitude: 8.32890 debye
