program: Orca
programVersion: 5.0.2
elementType: O O O N N C C C C C C C C C C C C C C C C C C H H H H H H H H H H H H H H H H H H H H H H H H H H H H
charge: 0
multiplicity: 1
keywords: wb97x-d3
keywords: def2-TZVPP
keywords: def2/J RIJCOSX
keywords: DEFGRID2
keywords: scfconv7
keywords: smallprint printgap noloewdin
keywords: NOSOSCF
formula: C18H28N2O3
InChI: InChI=1/C18H28N2O3/c1-11(2)16(20-18(22)23-12(3)4)17(21)19-14(6)15-9-7-13(5)8-10-15/h7-12,14,16,19-20H,1-6H3
51 atoms
O  2.249815 -1.71619 -1.610767
O  0.189572 2.846017 0.214829
O  0.320948 1.474923 -1.576667
N  0.997068 -1.198347 0.200991
N  1.855093 1.395215 0.084084
C  2.666522 0.396108 -0.571437
C  4.009103 0.246587 0.173819
C  1.937384 -0.940355 -0.715198
C  0.127044 -2.364026 0.189122
C  3.872914 -0.362752 1.566061
C  5.034654 -0.522449 -0.649813
C  -1.316474 -1.91005 0.181883
C  0.456518 -3.304045 1.34149
C  0.746756 1.882251 -0.513817
C  -2.072347 -1.995532 -0.983495
C  -1.915277 -1.361314 1.311941
C  -3.98985 -1.005452 0.112897
C  -3.386149 -1.55329 -1.017052
C  -3.229457 -0.915883 1.275838
C  -1.07239 3.39998 -0.217494
C  -5.414489 -0.538706 0.072847
C  -1.183599 4.752071 0.45271
C  -2.209213 2.46924 0.157696
H  2.893157 0.720716 -1.591851
H  4.385563 1.269832 0.285319
H  0.31907 -2.889304 -0.746614
H  3.135302 0.148287 2.188006
H  4.827043 -0.302239 2.091214
H  3.59675 -1.417873 1.521001
H  5.14103 -0.107959 -1.653837
H  6.011648 -0.468392 -0.168155
H  4.778956 -1.577833 -0.747787
H  0.81241 -0.496821 0.902876
H  2.20463 1.85089 0.914303
H  1.481389 -3.666465 1.253727
H  0.357067 -2.813424 2.310906
H  -0.20703 -4.169386 1.333115
H  -1.627855 -2.41306 -1.879874
H  -1.3583 -1.272508 2.237963
H  -3.949768 -1.634406 -1.939783
H  -3.668969 -0.488149 2.169692
H  -1.047771 3.536303 -1.301275
H  -5.67418 0.036728 0.961095
H  -5.605436 0.088642 -0.799086
H  -6.106697 -1.38159 0.015309
H  -0.353976 5.404973 0.178692
H  -2.105786 5.241185 0.138616
H  -1.208001 4.661913 1.540357
H  -3.160053 2.911068 -0.1437
H  -2.244674 2.304576 1.23627
H  -2.128179 1.502091 -0.338344
elementType: O N C H
totalener: -1038.16393672 hartree
nucrepener: 2082.95543735 hartree
electener: -3121.11937407 hartree
oneelecener: -5551.63560873 hartree
twoeener: 2430.51623466 hartree
cpcmener: -0.04229106 hartree
kineticenergy: 1033.38999599 hartree
xcener: -101.559995360441 hartree
chargesum: 0.0000000
charge: -0.522444 -0.336076 -0.519587 -0.164486 -0.243272 0.096952 0.063812 0.256624 0.172525 -0.311152 -0.312983 -0.031646 -0.288992 0.500358 -0.155612 -0.167498 -0.008755 -0.156228 -0.225219 0.171882 -0.210655 -0.257916 -0.253171 0.109000 0.056742 0.068843 0.093598 0.106292 0.086547 0.096889 0.096696 0.085044 0.174245 0.172289 0.102535 0.089353 0.102947 0.138774 0.145853 0.138757 0.136896 0.067491 0.091367 0.099934 0.107874 0.097023 0.091331 0.088666 0.101650 0.087604 0.069295
qa: -0.5224 -0.3361 -0.5196 -0.1645 -0.2433 0.0970 0.0638 0.2566 0.1725 -0.3112 -0.3130 -0.0316 -0.2890 0.5004 -0.1556 -0.1675 -0.0088 -0.1562 -0.2252 0.1719 -0.2107 -0.2579 -0.2532 0.1090 0.0567 0.0688 0.0936 0.1063 0.0865 0.0969 0.0967 0.0850 0.1742 0.1723 0.1025 0.0894 0.1029 0.1388 0.1459 0.1388 0.1369 0.0675 0.0914 0.0999 0.1079 0.0970 0.0913 0.0887 0.1016 0.0876 0.0693
va: 2.0071 2.0877 1.9885 3.1966 3.1579 3.8140 3.8370 4.1994 3.7359 3.9490 3.9543 3.6129 3.9530 4.3267 3.9414 3.9054 3.6794 3.9026 3.9189 3.8502 3.8961 3.9428 3.8906 1.0368 1.0154 1.0590 1.0074 1.0052 1.0047 1.0036 1.0022 1.0122 1.0205 1.0227 1.0040 1.0033 1.0068 1.0035 1.0000 0.9999 1.0037 1.0213 1.0050 0.9975 0.9948 1.0083 1.0053 1.0061 1.0084 1.0069 1.0260
dispcorr: -0.027626048 hartree
energy: -1038.191562772483
dipole: -0.43720 -0.13937 -0.57658 3.88468 -2.36749 1.51719 9.92383 -7.11748 2.80634
magnitude: 3.24189 au
magnitude: 8.24024 debye
