program: Orca
programVersion: 5.0.2
elementType: O O O N N C C C C C C C C C C C C C C C C C C H H H H H H H H H H H H H H H H H H H H H H H H H H H H
charge: 0
multiplicity: 1
keywords: wb97x-d3
keywords: def2-TZVPP
keywords: def2/J RIJCOSX
keywords: DEFGRID2
keywords: scfconv7
keywords: smallprint printgap noloewdin
keywords: NOSOSCF
formula: C18H28N2O3
InChI: InChI=1/C18H28N2O3/c1-11(2)16(20-18(22)23-12(3)4)17(21)19-14(6)15-9-7-13(5)8-10-15/h7-12,14,16,19-20H,1-6H3
51 atoms
O  2.218165 -1.732252 -1.595027
O  0.211158 2.848756 0.317313
O  0.312903 1.564828 -1.540741
N  0.973342 -1.18989 0.214984
N  1.856325 1.388095 0.105691
C  2.642666 0.393298 -0.584627
C  4.013231 0.245471 0.106785
C  1.91311 -0.946392 -0.705916
C  0.114689 -2.363528 0.233251
C  3.931297 -0.394356 1.489139
C  5.019997 -0.490352 -0.767354
C  -1.334049 -1.932206 0.160447
C  0.416165 -3.235666 1.445089
C  0.750731 1.913767 -0.46246
C  -2.069364 -2.128786 -1.004486
C  -1.960251 -1.304462 1.232775
C  -4.017729 -1.078696 -0.024795
C  -3.388631 -1.712017 -1.094886
C  -3.280127 -0.884792 1.139659
C  -1.035374 3.455627 -0.083872
C  -5.437723 -0.609801 -0.138957
C  -1.139498 4.741851 0.706259
C  -2.194691 2.516765 0.188273
H  2.82542 0.724347 -1.611506
H  4.38021 1.270612 0.227176
H  0.343403 -2.933665 -0.667001
H  4.900193 -0.331435 1.985888
H  3.668344 -1.451546 1.429046
H  3.20665 0.092199 2.144434
H  5.088287 -0.049679 -1.762825
H  6.010923 -0.436071 -0.315594
H  4.773501 -1.545219 -0.884235
H  0.796475 -0.482728 0.91402
H  2.208093 1.797192 0.958886
H  1.446856 -3.590689 1.411773
H  0.279064 -2.692543 2.381493
H  -0.239167 -4.106974 1.463952
H  -1.604108 -2.614213 -1.854777
H  -1.42103 -1.133441 2.157924
H  -3.93672 -1.879715 -2.015301
H  -3.742287 -0.395837 1.989471
H  -0.989724 3.69023 -1.150234
H  -5.5325 0.182497 -0.884232
H  -6.103555 -1.417155 -0.448153
H  -5.809057 -0.216399 0.806874
H  -1.186092 4.550228 1.780002
H  -0.295275 5.403817 0.509392
H  -2.048401 5.273149 0.423605
H  -2.125657 1.59801 -0.39298
H  -3.132372 3.003686 -0.082787
H  -2.248745 2.255285 1.246626
elementType: O N C H
totalener: -1038.16393997 hartree
nucrepener: 2078.30783650 hartree
electener: -3116.47177647 hartree
oneelecener: -5542.28595686 hartree
twoeener: 2425.81418039 hartree
cpcmener: -0.04231248 hartree
kineticenergy: 1033.40117980 hartree
xcener: -101.562061593187 hartree
chargesum: 0.0000000
charge: -0.522684 -0.335776 -0.519651 -0.167648 -0.242314 0.094037 0.062700 0.258003 0.179255 -0.308694 -0.311885 -0.029747 -0.289224 0.500063 -0.147134 -0.167895 0.012225 -0.175944 -0.242588 0.172454 -0.207239 -0.258686 -0.260423 0.108387 0.056335 0.069030 0.105893 0.087042 0.093071 0.096394 0.096395 0.084625 0.173315 0.173379 0.102162 0.090045 0.102794 0.139711 0.144505 0.139461 0.138629 0.067501 0.101930 0.104104 0.090618 0.088456 0.097130 0.091150 0.077888 0.102654 0.086193
qa: -0.5227 -0.3358 -0.5197 -0.1676 -0.2423 0.0940 0.0627 0.2580 0.1793 -0.3087 -0.3119 -0.0297 -0.2892 0.5001 -0.1471 -0.1679 0.0122 -0.1759 -0.2426 0.1725 -0.2072 -0.2587 -0.2604 0.1084 0.0563 0.0690 0.1059 0.0870 0.0931 0.0964 0.0964 0.0846 0.1733 0.1734 0.1022 0.0900 0.1028 0.1397 0.1445 0.1395 0.1386 0.0675 0.1019 0.1041 0.0906 0.0885 0.0971 0.0911 0.0779 0.1027 0.0862
va: 2.0078 2.0854 1.9893 3.2013 3.1581 3.8093 3.8355 4.2050 3.7315 3.9492 3.9552 3.6109 3.9556 4.3271 3.9394 3.8914 3.6753 3.9305 3.9260 3.8457 3.8961 3.9439 3.8836 1.0376 1.0164 1.0598 1.0052 1.0047 1.0071 1.0032 1.0022 1.0133 1.0221 1.0225 1.0042 1.0029 1.0067 1.0031 1.0012 1.0003 1.0031 1.0202 0.9947 0.9969 1.0057 1.0060 1.0083 1.0053 1.0235 1.0083 1.0062
dispcorr: -0.027376158 hartree
energy: -1038.191316128590
dipole: -0.25910 -0.26785 -0.52695 3.95596 -2.47977 1.47619 9.83473 -7.02021 2.81452
magnitude: 3.22154 au
magnitude: 8.18850 debye
