program: Orca
programVersion: 5.0.2
elementType: O O O N N C C C C C C C C C C C C C C C C C C H H H H H H H H H H H H H H H H H H H H H H H H H H H H
charge: 0
multiplicity: 1
keywords: wb97x-d3
keywords: def2-TZVPP
keywords: def2/J RIJCOSX
keywords: DEFGRID2
keywords: scfconv7
keywords: smallprint printgap noloewdin
keywords: NOSOSCF
formula: C18H28N2O3
InChI: InChI=1/C18H28N2O3/c1-11(2)16(20-18(22)23-12(3)4)17(21)19-14(6)15-9-7-13(5)8-10-15/h7-12,14,16,19-20H,1-6H3
51 atoms
O  2.365583 -2.343484 -0.768105
O  0.482613 2.955202 0.335063
O  0.913202 2.235102 -1.759946
N  0.502416 -1.389526 0.076342
N  1.591461 1.071226 0.076421
C  2.342144 0.049241 -0.610137
C  3.832568 0.075287 -0.231719
C  1.738829 -1.347045 -0.426651
C  -0.22669 -2.625993 0.314574
C  4.463998 1.401695 -0.636096
C  4.069438 -0.21276 1.247311
C  -1.711721 -2.370917 0.212506
C  0.150262 -3.239249 1.660608
C  0.994491 2.107441 -0.555767
C  -2.495705 -3.107447 -0.666683
C  -2.340085 -1.418048 1.012318
C  -4.494641 -1.937263 0.03635
C  -3.865918 -2.898037 -0.749432
C  -3.70585 -1.20225 0.920156
C  -0.178593 4.147842 -0.135165
C  -5.966413 -1.67527 -0.081912
C  0.844541 5.223614 -0.441229
C  -1.136108 4.556248 0.963746
H  2.266937 0.255046 -1.681761
H  4.311247 -0.715615 -0.813192
H  0.052197 -3.327314 -0.474106
H  5.538426 1.386692 -0.446433
H  4.048193 2.239639 -0.07258
H  4.320698 1.609964 -1.698073
H  3.677108 0.580086 1.888972
H  3.621214 -1.155203 1.567367
H  5.139053 -0.281171 1.451387
H  0.072382 -0.518338 0.347898
H  1.680666 1.129484 1.080998
H  -0.381315 -4.178932 1.814522
H  1.219676 -3.449411 1.703247
H  -0.099386 -2.570253 2.485341
H  -2.033243 -3.859071 -1.295884
H  -1.766802 -0.83405 1.724415
H  -4.451548 -3.491494 -1.441994
H  -4.167629 -0.451844 1.551598
H  -0.746622 3.908564 -1.037261
H  -6.501869 -2.547428 -0.456499
H  -6.404421 -1.39824 0.877155
H  -6.163367 -0.853024 -0.773711
H  1.535567 4.92016 -1.227945
H  0.337194 6.126697 -0.782661
H  1.423568 5.481358 0.447465
H  -0.607546 4.798133 1.887618
H  -1.861032 3.769339 1.175485
H  -1.691254 5.442414 0.656345
elementType: O N C H
totalener: -1038.16619079 hartree
nucrepener: 1997.92446563 hartree
electener: -3036.09065643 hartree
oneelecener: -5380.60314667 hartree
twoeener: 2344.51249025 hartree
cpcmener: -0.03773808 hartree
kineticenergy: 1033.39642983 hartree
xcener: -101.560691404470 hartree
chargesum: 0.0000000
charge: -0.540637 -0.335073 -0.519888 -0.189088 -0.279014 0.109880 0.070070 0.270309 0.187926 -0.316051 -0.299188 0.009075 -0.283731 0.521256 -0.164382 -0.206898 -0.012576 -0.165576 -0.196301 0.157237 -0.205165 -0.262077 -0.253608 0.110718 0.040569 0.063725 0.102641 0.081927 0.098741 0.081443 0.095732 0.098165 0.183188 0.177831 0.099838 0.099554 0.091842 0.141328 0.141633 0.139801 0.140492 0.065577 0.094317 0.095959 0.103244 0.094712 0.097075 0.087823 0.088218 0.096092 0.091317
qa: -0.5406 -0.3351 -0.5199 -0.1891 -0.2790 0.1099 0.0701 0.2703 0.1879 -0.3161 -0.2992 0.0091 -0.2837 0.5213 -0.1644 -0.2069 -0.0126 -0.1656 -0.1963 0.1572 -0.2052 -0.2621 -0.2536 0.1107 0.0406 0.0637 0.1026 0.0819 0.0987 0.0814 0.0957 0.0982 0.1832 0.1778 0.0998 0.0996 0.0918 0.1413 0.1416 0.1398 0.1405 0.0656 0.0943 0.0960 0.1032 0.0947 0.0971 0.0878 0.0882 0.0961 0.0913
va: 1.9782 2.0767 1.9901 3.2313 3.1665 3.8051 3.8351 4.2860 3.7529 3.9450 3.9395 3.6147 3.9387 4.3123 3.9513 3.9640 3.7368 3.9238 3.9583 3.8331 3.9013 3.9010 3.9368 1.0373 1.0415 1.0467 1.0038 1.0077 1.0036 1.0046 1.0082 1.0042 1.0162 1.0217 1.0070 1.0112 1.0022 1.0025 1.0069 1.0011 1.0008 1.0228 1.0027 1.0007 0.9931 1.0177 1.0068 1.0073 1.0065 1.0082 1.0055
dispcorr: -0.024060713 hartree
energy: -1038.190251507401
dipole: 2.32297 -3.72709 -1.40412 11.35670 -9.96993 1.38678 8.10097 -6.09494 2.00604
magnitude: 2.81405 au
magnitude: 7.15274 debye
