program: Orca
programVersion: 5.0.2
elementType: O O O N N C C C C C C C C C C C C C C C C C C H H H H H H H H H H H H H H H H H H H H H H H H H H H H
charge: 0
multiplicity: 1
keywords: wb97x-d3
keywords: def2-TZVPP
keywords: def2/J RIJCOSX
keywords: DEFGRID2
keywords: scfconv7
keywords: smallprint printgap noloewdin
keywords: NOSOSCF
formula: C18H28N2O3
InChI: InChI=1/C18H28N2O3/c1-11(2)16(20-18(22)23-12(3)4)17(21)19-14(6)15-9-7-13(5)8-10-15/h7-12,14,16,19-20H,1-6H3
51 atoms
O  2.029676 -1.742202 -1.642947
O  0.222509 2.895512 0.163229
O  0.152424 1.379247 -1.50979
N  1.018365 -1.189987 0.306319
N  1.853867 1.41123 -0.017743
C  2.602247 0.37112 -0.685403
C  3.989396 0.231186 -0.025493
C  1.84229 -0.955881 -0.722087
C  0.162166 -2.35791 0.439175
C  3.935238 -0.252739 1.42009
C  4.925164 -0.644007 -0.849357
C  -1.288158 -1.929022 0.316019
C  0.498149 -3.11117 1.716426
C  0.693248 1.864991 -0.535843
C  -2.173781 -1.923892 1.386588
C  -1.756902 -1.492727 -0.922509
C  -3.957886 -1.065174 -0.010833
C  -3.487467 -1.499774 1.223524
C  -3.066226 -1.071337 -1.083434
C  -1.068573 3.43587 -0.19004
C  -5.367609 -0.580869 -0.176499
C  -1.088676 4.852849 0.341113
C  -2.173373 2.578367 0.396342
H  2.762943 0.645526 -1.732946
H  4.407047 1.244713 -0.028664
H  0.39071 -3.007929 -0.406377
H  4.928192 -0.191937 1.867575
H  3.613206 -1.293124 1.48797
H  3.268501 0.343423 2.046315
H  4.621239 -1.691122 -0.846084
H  4.981002 -0.312855 -1.887454
H  5.933689 -0.598445 -0.435861
H  0.912266 -0.469165 1.006006
H  2.292546 1.936461 0.72444
H  -0.138447 -3.988503 1.832746
H  1.532395 -3.453783 1.683322
H  0.382428 -2.487932 2.604745
H  -1.855029 -2.258485 2.365739
H  -1.091233 -1.493026 -1.778288
H  -4.15632 -1.512868 2.076654
H  -3.402177 -0.745782 -2.061263
H  -1.158297 3.459649 -1.278536
H  -6.055242 -1.109539 0.484103
H  -5.448395 0.482702 0.060755
H  -5.719529 -0.71003 -1.20004
H  -0.997388 4.878157 1.42847
H  -0.284528 5.452127 -0.087723
H  -2.032252 5.329274 0.074801
H  -2.150498 1.558332 0.011611
H  -3.144091 3.002178 0.135503
H  -2.108042 2.538498 1.48526
elementType: O N C H
totalener: -1038.16375367 hartree
nucrepener: 2086.76130622 hartree
electener: -3124.92505990 hartree
oneelecener: -5559.42615516 hartree
twoeener: 2434.50109527 hartree
cpcmener: -0.04079000 hartree
kineticenergy: 1033.38896437 hartree
xcener: -101.561496841973 hartree
chargesum: 0.0000000
charge: -0.524438 -0.337210 -0.518584 -0.156702 -0.243580 0.102125 0.065753 0.260741 0.181754 -0.314258 -0.313244 -0.028949 -0.312211 0.502638 -0.158321 -0.214916 -0.033357 -0.169624 -0.160457 0.168479 -0.206268 -0.260116 -0.230096 0.112280 0.056335 0.091994 0.105945 0.084757 0.094812 0.084577 0.097912 0.096804 0.169067 0.170567 0.109758 0.102955 0.090455 0.143768 0.142467 0.138000 0.135618 0.066552 0.097271 0.100174 0.095682 0.088333 0.096823 0.091540 0.048933 0.098535 0.088926
qa: -0.5244 -0.3372 -0.5186 -0.1567 -0.2436 0.1021 0.0658 0.2607 0.1818 -0.3143 -0.3132 -0.0289 -0.3122 0.5026 -0.1583 -0.2149 -0.0334 -0.1696 -0.1605 0.1685 -0.2063 -0.2601 -0.2301 0.1123 0.0563 0.0920 0.1059 0.0848 0.0948 0.0846 0.0979 0.0968 0.1691 0.1706 0.1098 0.1030 0.0905 0.1438 0.1425 0.1380 0.1356 0.0666 0.0973 0.1002 0.0957 0.0883 0.0968 0.0915 0.0489 0.0985 0.0889
va: 1.9979 2.0889 1.9880 3.1714 3.1611 3.8226 3.8385 4.1858 3.7033 3.9504 3.9520 3.7018 3.9706 4.3221 3.9293 3.9139 3.7202 3.9532 3.8688 3.8457 3.8985 3.9459 3.9025 1.0349 1.0149 1.0445 1.0055 1.0060 1.0076 1.0111 1.0041 1.0023 1.0229 1.0236 1.0026 1.0051 0.9994 0.9992 1.0177 1.0012 1.0029 1.0219 1.0012 0.9930 1.0023 1.0062 1.0081 1.0051 1.0311 1.0090 1.0102
dispcorr: -0.027723779 hartree
energy: -1038.191477451227
dipole: 0.52007 -0.64762 -0.12755 4.70273 -3.04295 1.65978 9.78341 -7.02285 2.76056
magnitude: 3.22364 au
magnitude: 8.19383 debye
