program: Orca
programVersion: 5.0.2
elementType: O O O N N C C C C C C C C C C C C C C C C C C H H H H H H H H H H H H H H H H H H H H H H H H H H H H
charge: 0
multiplicity: 1
keywords: wb97x-d3
keywords: def2-TZVPP
keywords: def2/J RIJCOSX
keywords: DEFGRID2
keywords: scfconv7
keywords: smallprint printgap noloewdin
keywords: NOSOSCF
formula: C18H28N2O3
InChI: InChI=1/C18H28N2O3/c1-11(2)16(20-18(22)23-12(3)4)17(21)19-14(6)15-9-7-13(5)8-10-15/h7-12,14,16,19-20H,1-6H3
51 atoms
O  2.070287 -1.625951 -1.706136
O  0.204062 2.83991 0.45294
O  0.176212 1.518803 -1.380195
N  1.022547 -1.199572 0.255915
N  1.859354 1.41089 0.129097
C  2.611795 0.428354 -0.614973
C  4.007328 0.256365 0.020328
C  1.86148 -0.897966 -0.742835
C  0.152173 -2.365019 0.292867
C  3.975021 -0.354751 1.418024
C  4.952313 -0.524541 -0.884206
C  -1.288416 -1.919589 0.120111
C  0.420174 -3.177333 1.549681
C  0.697593 1.901594 -0.350792
C  -1.69613 -1.425664 -1.119932
C  -2.22161 -1.947565 1.147747
C  -3.93348 -1.015134 -0.292607
C  -2.991459 -0.983576 -1.322435
C  -3.523479 -1.501288 0.942673
C  -1.110525 3.367744 0.175699
C  -5.342486 -0.558085 -0.525428
C  -1.171595 4.71596 0.860018
C  -2.171102 2.408384 0.679675
H  2.760946 0.779857 -1.640544
H  4.405036 1.274438 0.103746
H  0.416705 -2.979119 -0.569139
H  3.291362 0.160499 2.096096
H  4.967314 -0.301319 1.868093
H  3.688034 -1.407621 1.393726
H  5.96558 -0.490779 -0.478925
H  4.670869 -1.575212 -0.966608
H  4.988502 -0.10472 -1.891174
H  0.894232 -0.520189 0.9917
H  2.274313 1.8436 0.941657
H  1.451671 -3.529837 1.550372
H  0.268118 -2.592747 2.458682
H  -0.229313 -4.05174 1.597007
H  -0.990634 -1.392559 -1.942525
H  -1.951275 -2.320399 2.127686
H  -3.276788 -0.607004 -2.298275
H  -4.2288 -1.535671 1.76516
H  -1.218822 3.507071 -0.902415
H  -5.917659 -1.312093 -1.067828
H  -5.863392 -0.364976 0.412154
H  -5.37505 0.355481 -1.120374
H  -2.135812 5.184105 0.661308
H  -1.062404 4.623843 1.942112
H  -0.396338 5.387941 0.489887
H  -2.113477 1.436958 0.187844
H  -3.162195 2.816517 0.476728
H  -2.086718 2.255172 1.757186
elementType: O N C H
totalener: -1038.16371905 hartree
nucrepener: 2090.86118462 hartree
electener: -3129.02490367 hartree
oneelecener: -5567.62244816 hartree
twoeener: 2438.59754449 hartree
cpcmener: -0.04071597 hartree
kineticenergy: 1033.38258044 hartree
xcener: -101.560364652257 hartree
chargesum: -0.0000000
charge: -0.524491 -0.336521 -0.518391 -0.155955 -0.242418 0.099397 0.063167 0.262023 0.182883 -0.312600 -0.313052 -0.034841 -0.311192 0.500564 -0.216049 -0.153392 -0.036095 -0.151999 -0.171667 0.167591 -0.208677 -0.259997 -0.219947 0.111227 0.057566 0.091860 0.093845 0.106152 0.085240 0.096830 0.084192 0.097726 0.168325 0.171985 0.102782 0.090003 0.109444 0.142283 0.143828 0.136207 0.137675 0.066628 0.105342 0.092146 0.097463 0.091260 0.088562 0.096743 0.037925 0.099118 0.089302
qa: -0.5245 -0.3365 -0.5184 -0.1560 -0.2424 0.0994 0.0632 0.2620 0.1829 -0.3126 -0.3131 -0.0348 -0.3112 0.5006 -0.2160 -0.1534 -0.0361 -0.1520 -0.1717 0.1676 -0.2087 -0.2600 -0.2199 0.1112 0.0576 0.0919 0.0938 0.1062 0.0852 0.0968 0.0842 0.0977 0.1683 0.1720 0.1028 0.0900 0.1094 0.1423 0.1438 0.1362 0.1377 0.0666 0.1053 0.0921 0.0975 0.0913 0.0886 0.0967 0.0379 0.0991 0.0893
va: 1.9981 2.0878 1.9889 3.1714 3.1618 3.8216 3.8387 4.1852 3.7081 3.9514 3.9521 3.6988 3.9726 4.3264 3.9154 3.9202 3.7155 3.8657 3.9421 3.8470 3.8986 3.9472 3.8996 1.0354 1.0150 1.0433 1.0076 1.0051 1.0061 1.0022 1.0117 1.0037 1.0245 1.0231 1.0054 0.9994 1.0023 1.0181 0.9990 1.0023 1.0017 1.0221 0.9943 1.0044 0.9987 1.0052 1.0060 1.0081 1.0350 1.0093 1.0106
dispcorr: -0.027957498 hartree
energy: -1038.191676546641
dipole: 0.22661 -0.45543 -0.22883 3.63398 -2.26149 1.37249 10.15089 -7.27775 2.87314
magnitude: 3.19234 au
magnitude: 8.11429 debye
