program: Orca
programVersion: 5.0.2
elementType: O O O N N C C C C C C C C C C C C C C C C C C H H H H H H H H H H H H H H H H H H H H H H H H H H H H
charge: 0
multiplicity: 1
keywords: wb97x-d3
keywords: def2-TZVPP
keywords: def2/J RIJCOSX
keywords: DEFGRID2
keywords: scfconv7
keywords: smallprint printgap noloewdin
keywords: NOSOSCF
formula: C18H28N2O3
InChI: InChI=1/C18H28N2O3/c1-11(2)16(20-18(22)23-12(3)4)17(21)19-14(6)15-9-7-13(5)8-10-15/h7-12,14,16,19-20H,1-6H3
51 atoms
O  2.034174 -1.805967 -1.581882
O  0.218463 2.874863 0.185464
O  0.135929 1.37705 -1.503638
N  1.016383 -1.196553 0.346926
N  1.845682 1.389317 -0.021439
C  2.582239 0.346978 -0.698686
C  3.99428 0.232867 -0.088775
C  1.837898 -0.989694 -0.689359
C  0.154454 -2.356238 0.511027
C  3.999896 -0.284326 1.346312
C  4.926119 -0.596317 -0.962725
C  -1.290607 -1.924581 0.342842
C  0.462581 -3.055706 1.825052
C  0.682607 1.851305 -0.527307
C  -2.200458 -1.883337 1.390991
C  -1.723913 -1.507736 -0.916182
C  -3.937733 -1.026263 -0.065451
C  -3.503384 -1.440186 1.187988
C  -3.020536 -1.068196 -1.116617
C  -1.080539 3.412349 -0.144656
C  -5.348204 -0.570487 -0.291931
C  -1.104461 4.819164 0.41244
C  -2.172658 2.536609 0.438427
H  2.700909 0.609273 -1.754648
H  4.383016 1.257614 -0.082712
H  0.396063 -3.041598 -0.302503
H  5.001603 -0.193345 1.768531
H  3.722687 -1.338605 1.397613
H  3.326459 0.269177 2.003751
H  4.656402 -1.652589 -0.967457
H  4.930022 -0.245688 -1.995949
H  5.947877 -0.523488 -0.587629
H  0.899368 -0.449452 1.016438
H  2.286506 1.897781 0.731274
H  -0.176857 -3.927392 1.964987
H  1.497245 -3.39856 1.828317
H  0.328809 -2.395548 2.683739
H  -1.909157 -2.195484 2.386049
H  -1.03676 -1.530741 -1.754485
H  -4.189687 -1.416924 2.026835
H  -3.325521 -0.749908 -2.107032
H  -1.181762 3.454743 -1.231627
H  -5.968605 -1.383107 -0.67711
H  -5.811285 -0.219943 0.630241
H  -5.395388 0.23968 -1.020305
H  -0.99711 4.824822 1.498632
H  -0.312302 5.433841 -0.016892
H  -2.056253 5.291927 0.169668
H  -2.144434 1.522512 0.038967
H  -3.149355 2.955151 0.191777
H  -2.097889 2.481624 1.526103
elementType: O N C H
totalener: -1038.16369610 hartree
nucrepener: 2088.77183037 hartree
electener: -3126.93552647 hartree
oneelecener: -5563.44076282 hartree
twoeener: 2436.50523635 hartree
cpcmener: -0.04044828 hartree
kineticenergy: 1033.39030718 hartree
xcener: -101.561760344252 hartree
chargesum: -0.0000000
charge: -0.524629 -0.336850 -0.518696 -0.154644 -0.241391 0.101164 0.064372 0.260679 0.182194 -0.311799 -0.313969 -0.034555 -0.310957 0.500481 -0.156729 -0.216633 -0.034257 -0.167892 -0.155133 0.167708 -0.208138 -0.260371 -0.225195 0.110405 0.055518 0.091784 0.106102 0.085445 0.093896 0.084532 0.097177 0.097264 0.168735 0.171958 0.108930 0.102652 0.090169 0.143450 0.143738 0.137898 0.134958 0.066665 0.105750 0.093337 0.096173 0.088474 0.097013 0.091359 0.044217 0.098687 0.088952
qa: -0.5246 -0.3368 -0.5187 -0.1546 -0.2414 0.1012 0.0644 0.2607 0.1822 -0.3118 -0.3140 -0.0346 -0.3110 0.5005 -0.1567 -0.2166 -0.0343 -0.1679 -0.1551 0.1677 -0.2081 -0.2604 -0.2252 0.1104 0.0555 0.0918 0.1061 0.0854 0.0939 0.0845 0.0972 0.0973 0.1687 0.1720 0.1089 0.1027 0.0902 0.1434 0.1437 0.1379 0.1350 0.0667 0.1057 0.0933 0.0962 0.0885 0.0970 0.0914 0.0442 0.0987 0.0890
va: 1.9985 2.0886 1.9877 3.1697 3.1614 3.8158 3.8371 4.1886 3.7082 3.9507 3.9524 3.7080 3.9728 4.3247 3.9262 3.9145 3.7111 3.9462 3.8636 3.8460 3.8971 3.9466 3.8995 1.0361 1.0153 1.0438 1.0052 1.0057 1.0074 1.0122 1.0035 1.0022 1.0246 1.0228 1.0023 1.0056 0.9994 0.9994 1.0175 1.0014 1.0033 1.0219 0.9941 1.0032 1.0001 1.0062 1.0080 1.0050 1.0341 1.0092 1.0104
dispcorr: -0.027829952 hartree
energy: -1038.191526054752
dipole: 0.54887 -0.70753 -0.15865 4.82722 -3.15721 1.67001 9.47874 -6.77404 2.70469
magnitude: 3.18269 au
magnitude: 8.08974 debye
