program: Orca
programVersion: 5.0.2
elementType: O O O N N C C C C C C C C C C C C C C C C C C H H H H H H H H H H H H H H H H H H H H H H H H H H H H
charge: 0
multiplicity: 1
keywords: wb97x-d3
keywords: def2-TZVPP
keywords: def2/J RIJCOSX
keywords: DEFGRID2
keywords: scfconv7
keywords: smallprint printgap noloewdin
keywords: NOSOSCF
formula: C18H28N2O3
InChI: InChI=1/C18H28N2O3/c1-11(2)16(20-18(22)23-12(3)4)17(21)19-14(6)15-9-7-13(5)8-10-15/h7-12,14,16,19-20H,1-6H3
51 atoms
O  1.976786 -1.783888 -1.621101
O  0.203483 2.844724 0.188238
O  0.11409 1.337063 -1.491515
N  1.052684 -1.188885 0.358629
N  1.862014 1.400371 -0.056938
C  2.588855 0.351544 -0.733762
C  4.004609 0.232709 -0.135284
C  1.830903 -0.978016 -0.710023
C  0.167685 -2.329377 0.53613
C  4.021931 -0.229243 1.317979
C  4.906342 -0.648799 -0.98888
C  -1.269555 -1.879517 0.346595
C  0.451404 -3.005323 1.867944
C  0.674334 1.829649 -0.53199
C  -2.156658 -1.708108 1.400775
C  -1.717651 -1.579857 -0.940598
C  -3.905577 -0.970221 -0.105382
C  -3.454437 -1.259264 1.176434
C  -3.009287 -1.136389 -1.162342
C  -1.123873 3.334661 -0.098545
C  -5.310173 -0.510423 -0.357835
C  -1.180151 4.739833 0.460066
C  -2.162038 2.418256 0.519887
H  2.701308 0.604961 -1.792559
H  4.413413 1.248807 -0.173087
H  0.405503 -3.036154 -0.259695
H  3.374339 0.365086 1.965172
H  5.032629 -0.145075 1.719411
H  3.721441 -1.273378 1.414913
H  5.933885 -0.588003 -0.627387
H  4.611346 -1.697857 -0.952668
H  4.906586 -0.335787 -2.033987
H  0.97121 -0.447071 1.039191
H  2.313203 1.923865 0.678869
H  -0.216988 -3.851586 2.026855
H  1.474371 -3.381316 1.883349
H  0.337485 -2.321181 2.710434
H  -1.853104 -1.92525 2.417192
H  -1.047008 -1.703511 -1.783309
H  -4.123886 -1.135574 2.019889
H  -3.328041 -0.915957 -2.174782
H  -1.262975 3.372652 -1.181524
H  -5.336554 0.342086 -1.037882
H  -5.908485 -1.301037 -0.816125
H  -5.810029 -0.217488 0.564965
H  -2.154602 5.179272 0.246344
H  -1.040006 4.749805 1.542482
H  -0.423015 5.381164 0.007164
H  -3.161752 2.799467 0.30716
H  -2.048181 2.365893 1.604292
H  -2.10798 1.406616 0.117309
elementType: O N C H
totalener: -1038.16352463 hartree
nucrepener: 2097.12738657 hartree
electener: -3135.29091120 hartree
oneelecener: -5580.22629470 hartree
twoeener: 2444.93538351 hartree
cpcmener: -0.04110864 hartree
kineticenergy: 1033.39945071 hartree
xcener: -101.563869183612 hartree
chargesum: 0.0000000
charge: -0.523033 -0.336949 -0.517547 -0.154195 -0.242260 0.104767 0.063477 0.255680 0.176158 -0.312994 -0.313694 -0.027076 -0.309568 0.499910 -0.153830 -0.216036 -0.040347 -0.175988 -0.142728 0.169973 -0.212584 -0.261197 -0.216917 0.111655 0.057099 0.091674 0.094079 0.106069 0.085114 0.097108 0.084616 0.097739 0.168114 0.171704 0.110385 0.102500 0.089690 0.143074 0.141510 0.137279 0.136923 0.067099 0.098321 0.106173 0.091713 0.091449 0.088419 0.097104 0.099301 0.089619 0.031451
qa: -0.5230 -0.3369 -0.5175 -0.1542 -0.2423 0.1048 0.0635 0.2557 0.1762 -0.3130 -0.3137 -0.0271 -0.3096 0.4999 -0.1538 -0.2160 -0.0403 -0.1760 -0.1427 0.1700 -0.2126 -0.2612 -0.2169 0.1117 0.0571 0.0917 0.0941 0.1061 0.0851 0.0971 0.0846 0.0977 0.1681 0.1717 0.1104 0.1025 0.0897 0.1431 0.1415 0.1373 0.1369 0.0671 0.0983 0.1062 0.0917 0.0914 0.0884 0.0971 0.0993 0.0896 0.0315
va: 1.9994 2.0889 1.9893 3.1712 3.1638 3.8199 3.8407 4.1844 3.7176 3.9501 3.9511 3.6695 3.9702 4.3257 3.9170 3.9175 3.7116 3.9317 3.8619 3.8471 3.8979 3.9479 3.8972 1.0350 1.0150 1.0422 1.0078 1.0052 1.0067 1.0023 1.0111 1.0041 1.0241 1.0231 1.0025 1.0053 0.9995 0.9986 1.0188 1.0023 1.0010 1.0219 0.9977 0.9945 1.0050 1.0050 1.0061 1.0080 1.0095 1.0101 1.0374
dispcorr: -0.028233880 hartree
energy: -1038.191758510907
dipole: 0.55561 -0.63503 -0.07942 4.59856 -2.94445 1.65411 9.68626 -6.95994 2.72632
magnitude: 3.18986 au
magnitude: 8.10797 debye
