program: Orca
programVersion: 5.0.2
elementType: O O O N N C C C C C C C C C C C C C C C C C C H H H H H H H H H H H H H H H H H H H H H H H H H H H H
charge: 0
multiplicity: 1
keywords: wb97x-d3
keywords: def2-TZVPP
keywords: def2/J RIJCOSX
keywords: DEFGRID2
keywords: scfconv7
keywords: smallprint printgap noloewdin
keywords: NOSOSCF
formula: C18H28N2O3
InChI: InChI=1/C18H28N2O3/c1-11(2)16(20-18(22)23-12(3)4)17(21)19-14(6)15-9-7-13(5)8-10-15/h7-12,14,16,19-20H,1-6H3
51 atoms
O  1.919886 -1.78671 -1.68496
O  -0.121828 2.495871 0.350522
O  -0.091382 0.990518 -1.330424
N  1.21861 -1.396445 0.432298
N  1.709126 1.292712 0.001674
C  2.509656 0.322418 -0.710572
C  3.946374 0.304983 -0.153419
C  1.84559 -1.057845 -0.705122
C  0.244496 -2.473531 0.540878
C  4.054817 -0.18813 1.285566
C  4.876997 -0.487365 -1.06226
C  -1.139803 -1.880495 0.370921
C  0.435461 -3.226696 1.84791
C  0.449083 1.560107 -0.402078
C  -1.715732 -1.097468 1.367287
C  -1.823047 -2.017477 -0.833091
C  -3.614676 -0.591564 -0.047284
C  -2.933969 -0.465967 1.160763
C  -3.039263 -1.383424 -1.038638
C  -1.504208 2.83178 0.096045
C  -4.914169 0.117271 -0.285947
C  -1.601202 3.852038 -1.01947
C  -2.062433 3.345783 1.405157
H  2.576198 0.605973 -1.765562
H  4.273388 1.350366 -0.178678
H  0.432723 -3.16157 -0.283317
H  5.069583 -0.028249 1.652639
H  3.846553 -1.255729 1.365105
H  3.384959 0.335745 1.970453
H  4.823505 -0.141934 -2.09611
H  5.910157 -0.372805 -0.729462
H  4.651082 -1.555015 -1.05247
H  1.170217 -0.694396 1.158315
H  2.125314 1.843435 0.738487
H  -0.299836 -4.026247 1.938911
H  1.428187 -3.676332 1.885303
H  0.331222 -2.576573 2.717958
H  -1.212485 -0.962436 2.318082
H  -1.393157 -2.616788 -1.627342
H  -3.358131 0.141514 1.952136
H  -3.544522 -1.500385 -1.990669
H  -2.040557 1.923318 -0.187733
H  -5.716737 -0.583624 -0.522932
H  -5.223771 0.69071 0.587488
H  -4.840106 0.810197 -1.126176
H  -2.646918 4.115221 -1.183392
H  -1.061904 4.767424 -0.768933
H  -1.21024 3.466201 -1.960722
H  -3.123965 3.564493 1.28683
H  -1.565517 4.263479 1.724456
H  -1.965175 2.605327 2.200132
elementType: O N C H
totalener: -1038.16191279 hartree
nucrepener: 2128.75086014 hartree
electener: -3166.91277293 hartree
oneelecener: -5643.65401104 hartree
twoeener: 2476.74123811 hartree
cpcmener: -0.04466645 hartree
kineticenergy: 1033.40002287 hartree
xcener: -101.562476537514 hartree
chargesum: 0.0000000
charge: -0.511507 -0.341151 -0.517775 -0.168183 -0.237233 0.110728 0.062077 0.234613 0.176994 -0.315486 -0.311398 -0.031372 -0.286746 0.491123 -0.153979 -0.169421 0.011847 -0.242728 -0.165675 0.187998 -0.216563 -0.268257 -0.259777 0.110384 0.057939 0.079382 0.106140 0.085981 0.095927 0.098084 0.097372 0.085887 0.170509 0.171856 0.100704 0.101274 0.090039 0.142550 0.135927 0.141124 0.137954 0.035088 0.110434 0.091176 0.102964 0.096755 0.093076 0.096278 0.093923 0.099971 0.093174
qa: -0.5115 -0.3412 -0.5178 -0.1682 -0.2372 0.1107 0.0621 0.2346 0.1770 -0.3155 -0.3114 -0.0314 -0.2867 0.4911 -0.1540 -0.1694 0.0118 -0.2427 -0.1657 0.1880 -0.2166 -0.2683 -0.2598 0.1104 0.0579 0.0794 0.1061 0.0860 0.0959 0.0981 0.0974 0.0859 0.1705 0.1719 0.1007 0.1013 0.0900 0.1426 0.1359 0.1411 0.1380 0.0351 0.1104 0.0912 0.1030 0.0968 0.0931 0.0963 0.0939 0.1000 0.0932
va: 2.0106 2.0839 1.9810 3.1786 3.1645 3.7900 3.8499 4.2104 3.7758 3.9410 3.9471 3.5977 3.9578 4.3337 3.8765 3.9268 3.6489 3.9201 3.9460 3.8104 3.8949 3.9261 3.9249 1.0339 1.0151 1.0414 1.0054 1.0104 1.0074 1.0044 1.0020 1.0093 1.0189 1.0224 1.0056 1.0055 1.0024 1.0009 1.0090 1.0000 0.9997 1.0358 0.9970 1.0052 0.9939 1.0058 1.0077 1.0166 1.0056 1.0076 1.0079
dispcorr: -0.029393957 hartree
energy: -1038.191306747633
dipole: 1.03728 -1.08170 -0.04442 6.68286 -4.96000 1.72286 8.03607 -5.30956 2.72651
magnitude: 3.22554 au
magnitude: 8.19867 debye
