program: Orca
programVersion: 5.0.2
elementType: O O O N N C C C C C C C C C C C C C C C C C C H H H H H H H H H H H H H H H H H H H H H H H H H H H H
charge: 0
multiplicity: 1
keywords: wb97x-d3
keywords: def2-TZVPP
keywords: def2/J RIJCOSX
keywords: DEFGRID2
keywords: scfconv7
keywords: smallprint printgap noloewdin
keywords: NOSOSCF
formula: C18H28N2O3
InChI: InChI=1/C18H28N2O3/c1-11(2)16(20-18(22)23-12(3)4)17(21)19-14(6)15-9-7-13(5)8-10-15/h7-12,14,16,19-20H,1-6H3
51 atoms
O  2.285441 -2.125428 -1.364296
O  0.394283 2.777265 0.1270
O  0.516404 1.564084 -1.775434
N  0.813083 -1.266671 0.122275
N  1.937211 1.20967 -0.044156
C  2.654531 0.126054 -0.667383
C  4.043839 -0.06197 -0.031696
C  1.88817 -1.199005 -0.667004
C  -0.05499 -2.428491 0.237067
C  4.891325 1.192929 -0.196398
C  3.989893 -0.502968 1.427086
C  -1.497712 -1.975144 0.207978
C  0.283404 -3.246684 1.477828
C  0.909946 1.834176 -0.658685
C  -2.318442 -2.296835 -0.866236
C  -2.037949 -1.211668 1.240928
C  -4.178364 -1.09699 0.113091
C  -3.638226 -1.868315 -0.911288
C  -3.353531 -0.778254 1.190919
C  -0.788067 3.481343 -0.307224
C  -5.589854 -0.595529 0.048397
C  -0.82826 4.75843 0.503049
C  -2.020005 2.624218 -0.09326
H  2.81255 0.369572 -1.72163
H  4.519364 -0.861413 -0.604951
H  0.125103 -3.046464 -0.643158
H  5.911582 1.00854 0.142062
H  4.504743 2.031692 0.385347
H  4.942383 1.507083 -1.239904
H  3.536442 0.247453 2.078672
H  3.440838 -1.435851 1.561671
H  5.000225 -0.672023 1.800964
H  0.598076 -0.470354 0.703483
H  2.194593 1.510466 0.883933
H  -0.370769 -4.115828 1.554368
H  1.312448 -3.605017 1.429328
H  0.172371 -2.660317 2.391066
H  -1.925045 -2.892735 -1.681563
H  -1.431866 -0.945848 2.1001
H  -4.254292 -2.139419 -1.760847
H  -3.746356 -0.18308 2.007297
H  -0.686792 3.729267 -1.366173
H  -5.630346 0.404819 -0.388267
H  -6.218293 -1.240545 -0.565545
H  -6.04042 -0.531007 1.038734
H  0.06897 5.358576 0.34963
H  -1.684318 5.359897 0.197104
H  -0.929716 4.552874 1.56991
H  -2.134329 2.355761 0.95828
H  -1.994059 1.709575 -0.684715
H  -2.908674 3.181255 -0.392548
elementType: O N C H
totalener: -1038.16597580 hartree
nucrepener: 2062.59209577 hartree
electener: -3100.75807156 hartree
oneelecener: -5510.34639682 hartree
twoeener: 2409.58832526 hartree
cpcmener: -0.04146515 hartree
kineticenergy: 1033.40870085 hartree
xcener: -101.563471654718 hartree
chargesum: -0.0000000
charge: -0.534454 -0.334494 -0.519949 -0.169540 -0.270279 0.099899 0.062526 0.264076 0.187338 -0.299700 -0.303235 -0.011769 -0.292993 0.505051 -0.150795 -0.189996 0.010431 -0.169878 -0.235277 0.170611 -0.201940 -0.257327 -0.266218 0.107196 0.049653 0.064805 0.097308 0.082864 0.096798 0.083383 0.093274 0.101567 0.175157 0.180657 0.103596 0.103411 0.091424 0.141271 0.144561 0.139442 0.140463 0.067295 0.101931 0.094565 0.096111 0.096908 0.091170 0.088524 0.085040 0.086545 0.102997
qa: -0.5345 -0.3345 -0.5199 -0.1695 -0.2703 0.0999 0.0625 0.2641 0.1873 -0.2997 -0.3032 -0.0118 -0.2930 0.5051 -0.1508 -0.1900 0.0104 -0.1699 -0.2353 0.1706 -0.2019 -0.2573 -0.2662 0.1072 0.0497 0.0648 0.0973 0.0829 0.0968 0.0834 0.0933 0.1016 0.1752 0.1807 0.1036 0.1034 0.0914 0.1413 0.1446 0.1394 0.1405 0.0673 0.1019 0.0946 0.0961 0.0969 0.0912 0.0885 0.0850 0.0865 0.1030
va: 1.9960 2.0811 1.9914 3.2050 3.1575 3.8034 3.7928 4.2498 3.7338 3.9475 3.9499 3.6002 3.9535 4.3265 3.9455 3.9091 3.6958 3.9302 3.9314 3.8361 3.8976 3.9417 3.8881 1.0365 1.0365 1.0570 1.0042 1.0070 1.0040 1.0033 1.0096 1.0046 1.0229 1.0208 1.0070 1.0045 1.0024 1.0017 1.0025 1.0011 1.0018 1.0211 0.9936 1.0026 1.0011 1.0083 1.0056 1.0060 1.0070 1.0189 1.0083
dispcorr: -0.026618037 hartree
energy: -1038.192593833462
dipole: -0.45798 -0.35238 -0.81036 7.68085 -6.13751 1.54334 10.44724 -7.81266 2.63458
magnitude: 3.15905 au
magnitude: 8.02966 debye
