program: Orca
programVersion: 5.0.2
elementType: O O O N N C C C C C C C C C C C C C C C C C C H H H H H H H H H H H H H H H H H H H H H H H H H H H H
charge: 0
multiplicity: 1
keywords: wb97x-d3
keywords: def2-TZVPP
keywords: def2/J RIJCOSX
keywords: DEFGRID2
keywords: scfconv7
keywords: smallprint printgap noloewdin
keywords: NOSOSCF
formula: C18H28N2O3
InChI: InChI=1/C18H28N2O3/c1-11(2)16(20-18(22)23-12(3)4)17(21)19-14(6)15-9-7-13(5)8-10-15/h7-12,14,16,19-20H,1-6H3
51 atoms
O  2.015525 -1.754292 -1.705025
O  -0.165153 2.454108 0.300857
O  -0.023803 0.989269 -1.410953
N  1.212609 -1.395583 0.382772
N  1.706274 1.298492 0.009262
C  2.549116 0.342712 -0.672656
C  3.954015 0.321259 -0.041826
C  1.889131 -1.039487 -0.720633
C  0.239712 -2.477731 0.439928
C  3.983587 -0.153141 1.407616
C  4.922261 -0.494558 -0.889602
C  -1.145532 -1.870668 0.346596
C  0.460026 -3.324783 1.683605
C  0.460553 1.547878 -0.445713
C  -1.696374 -1.161929 1.410315
C  -1.855042 -1.914123 -0.84943
C  -3.619453 -0.539116 0.07636
C  -2.913946 -0.509252 1.276317
C  -3.070446 -1.259498 -0.982536
C  -1.5370 2.773072 -0.021512
C  -4.92172 0.188095 -0.080085
C  -1.591432 3.79999 -1.134132
C  -2.167582 3.270959 1.260555
H  2.670042 0.64024 -1.719015
H  4.292925 1.363147 -0.064437
H  0.404989 -3.102757 -0.437503
H  3.755373 -1.216716 1.490672
H  3.288672 0.389221 2.052139
H  4.98115 -0.002937 1.822666
H  4.921423 -0.170331 -1.931351
H  5.938309 -0.379592 -0.51013
H  4.688507 -1.560038 -0.870008
H  1.135802 -0.706374 1.117592
H  2.077253 1.841498 0.774561
H  -0.277554 -4.125735 1.737652
H  1.450668 -3.779807 1.661069
H  0.383986 -2.737695 2.600189
H  -1.172555 -1.099909 2.357527
H  -1.445266 -2.45387 -1.69543
H  -3.316866 0.039818 2.119633
H  -3.595499 -1.301947 -1.93013
H  -2.045635 1.858883 -0.336667
H  -5.752242 -0.505317 -0.22719
H  -5.150512 0.792778 0.797322
H  -4.90619 0.852223 -0.945772
H  -1.07726 4.720177 -0.850369
H  -1.14757 3.426462 -2.056814
H  -2.630584 4.051295 -1.350242
H  -3.226217 3.469814 1.091966
H  -1.704404 4.196985 1.606414
H  -2.094419 2.529623 2.057381
elementType: O N C H
totalener: -1038.16153394 hartree
nucrepener: 2130.83449923 hartree
electener: -3168.99603317 hartree
oneelecener: -5647.70838966 hartree
twoeener: 2478.71235650 hartree
cpcmener: -0.04414514 hartree
kineticenergy: 1033.40090465 hartree
xcener: -101.562798286528 hartree
chargesum: 0.0000000
charge: -0.511335 -0.341223 -0.517556 -0.168058 -0.239187 0.109639 0.061434 0.234558 0.176704 -0.316699 -0.312454 -0.016452 -0.285245 0.491813 -0.166643 -0.191970 -0.018207 -0.218269 -0.137253 0.190200 -0.218157 -0.269506 -0.264299 0.111152 0.059885 0.077530 0.085963 0.095559 0.105994 0.098655 0.097690 0.086292 0.171433 0.172386 0.100647 0.100901 0.089118 0.143644 0.135579 0.140558 0.137363 0.036459 0.112591 0.090896 0.101976 0.093286 0.096483 0.096951 0.094156 0.101401 0.093621
qa: -0.5113 -0.3412 -0.5176 -0.1681 -0.2392 0.1096 0.0614 0.2346 0.1767 -0.3167 -0.3125 -0.0165 -0.2852 0.4918 -0.1666 -0.1920 -0.0182 -0.2183 -0.1373 0.1902 -0.2182 -0.2695 -0.2643 0.1112 0.0599 0.0775 0.0860 0.0956 0.1060 0.0987 0.0977 0.0863 0.1714 0.1724 0.1006 0.1009 0.0891 0.1436 0.1356 0.1406 0.1374 0.0365 0.1126 0.0909 0.1020 0.0933 0.0965 0.0970 0.0942 0.1014 0.0936
va: 2.0117 2.0822 1.9810 3.1780 3.1662 3.7938 3.8510 4.2122 3.7691 3.9398 3.9473 3.5900 3.9564 4.3309 3.9001 3.9343 3.6604 3.9037 3.9017 3.8001 3.8951 3.9273 3.9258 1.0332 1.0145 1.0468 1.0105 1.0078 1.0055 1.0048 1.0022 1.0085 1.0179 1.0224 1.0058 1.0056 1.0027 1.0005 1.0081 1.0001 0.9991 1.0379 0.9964 1.0046 0.9950 1.0077 1.0170 1.0057 1.0051 1.0081 1.0075
dispcorr: -0.029614807 hartree
energy: -1038.191148747192
dipole: 0.64504 -0.84355 -0.19851 6.39575 -4.72346 1.67229 8.32603 -5.55759 2.76844
magnitude: 3.24040 au
magnitude: 8.23645 debye
