program: Orca
programVersion: 5.0.2
elementType: O O O N N C C C C C C C C C C C C C C C C C C H H H H H H H H H H H H H H H H H H H H H H H H H H H H
charge: 0
multiplicity: 1
keywords: wb97x-d3
keywords: def2-TZVPP
keywords: def2/J RIJCOSX
keywords: DEFGRID2
keywords: scfconv7
keywords: smallprint printgap noloewdin
keywords: NOSOSCF
formula: C18H28N2O3
InChI: InChI=1/C18H28N2O3/c1-11(2)16(20-18(22)23-12(3)4)17(21)19-14(6)15-9-7-13(5)8-10-15/h7-12,14,16,19-20H,1-6H3
51 atoms
O  2.116992 -2.107478 -1.414927
O  0.317983 2.695346 0.379586
O  0.231843 1.456295 -1.50802
N  0.907847 -1.34401 0.342347
N  1.885887 1.182137 0.017413
C  2.55021 0.126109 -0.70381
C  4.018268 -0.021818 -0.267962
C  1.826582 -1.220468 -0.62122
C  0.005355 -2.472679 0.498131
C  4.80243 1.252626 -0.557025
C  4.178079 -0.45241 1.186372
C  -1.411592 -1.992368 0.239872
C  0.220023 -3.139827 1.846663
C  0.76088 1.759194 -0.456503
C  -1.725375 -1.479645 -1.01779
C  -2.411231 -2.007996 1.205368
C  -3.99569 -1.003479 -0.329025
C  -2.992678 -0.996128 -1.297331
C  -3.682249 -1.521903 0.923238
C  -0.919175 3.373274 0.073437
C  -5.359324 -0.45012 -0.617529
C  -0.87073 4.689562 0.818505
C  -2.09967 2.516586 0.486461
H  2.555521 0.378906 -1.768076
H  4.428186 -0.81448 -0.899138
H  0.265996 -3.190507 -0.281303
H  5.863975 1.098892 -0.357806
H  4.475026 2.089293 0.063274
H  4.7040 1.554462 -1.601458
H  3.664653 -1.390608 1.403304
H  5.233814 -0.605291 1.414637
H  3.810084 0.29833 1.890144
H  0.740868 -0.550378 0.943642
H  2.265254 1.50596 0.89491
H  0.039266 -2.454473 2.676662
H  -0.436604 -4.001379 1.968989
H  1.248186 -3.493422 1.92464
H  -0.970482 -1.462932 -1.795962
H  -2.214584 -2.401451 2.194631
H  -3.205119 -0.604802 -2.285544
H  -4.440748 -1.547247 1.697686
H  -0.961065 3.57035 -1.000355
H  -5.511298 -0.294238 -1.685365
H  -6.147961 -1.114389 -0.26151
H  -5.506924 0.512973 -0.123536
H  -0.006898 5.286475 0.522755
H  -1.765385 5.270308 0.59329
H  -0.834057 4.540095 1.89928
H  -3.029835 3.043342 0.268678
H  -2.078808 2.304593 1.557121
H  -2.129213 1.568619 -0.051723
elementType: O N C H
totalener: -1038.16518034 hartree
nucrepener: 2081.30942853 hartree
electener: -3119.47460887 hartree
oneelecener: -5548.07709686 hartree
twoeener: 2428.60248799 hartree
cpcmener: -0.03942298 hartree
kineticenergy: 1033.39152613 hartree
xcener: -101.562431733587 hartree
chargesum: 0.0000000
charge: -0.533163 -0.334397 -0.521048 -0.158107 -0.266904 0.100542 0.061311 0.269233 0.200712 -0.300110 -0.303630 -0.047829 -0.306699 0.505860 -0.216832 -0.156549 -0.027841 -0.156891 -0.171401 0.169324 -0.206699 -0.260321 -0.235342 0.107030 0.050670 0.090966 0.097222 0.083430 0.096790 0.092095 0.101639 0.082717 0.169564 0.181631 0.091087 0.105121 0.102389 0.145870 0.144089 0.136054 0.138206 0.066344 0.092394 0.101119 0.100568 0.096681 0.091607 0.088662 0.098957 0.088683 0.055196
qa: -0.5332 -0.3344 -0.5210 -0.1581 -0.2669 0.1005 0.0613 0.2692 0.2007 -0.3001 -0.3036 -0.0478 -0.3067 0.5059 -0.2168 -0.1565 -0.0278 -0.1569 -0.1714 0.1693 -0.2067 -0.2603 -0.2353 0.1070 0.0507 0.0910 0.0972 0.0834 0.0968 0.0921 0.1016 0.0827 0.1696 0.1816 0.0911 0.1051 0.1024 0.1459 0.1441 0.1361 0.1382 0.0663 0.0924 0.1011 0.1006 0.0967 0.0916 0.0887 0.0990 0.0887 0.0552
va: 1.9941 2.0852 1.9860 3.1718 3.1594 3.7867 3.7920 4.2449 3.6908 3.9421 3.9471 3.7397 3.9791 4.3181 3.9186 3.9159 3.7161 3.8671 3.9525 3.8436 3.8973 3.9463 3.9001 1.0370 1.0345 1.0433 1.0042 1.0066 1.0038 1.0128 1.0038 1.0032 1.0272 1.0198 0.9994 1.0015 1.0065 1.0139 1.0002 1.0040 1.0012 1.0216 1.0049 0.9983 0.9938 1.0083 1.0051 1.0060 1.0096 1.0096 1.0289
dispcorr: -0.027433304 hartree
energy: -1038.192613642503
dipole: 0.39428 -0.78766 -0.39338 8.31126 -6.74279 1.56847 9.88632 -7.23308 2.65324
magnitude: 3.10717 au
magnitude: 7.89781 debye
