program: Orca
programVersion: 5.0.2
elementType: O O O N N C C C C C C C C C C C C C C C C C C H H H H H H H H H H H H H H H H H H H H H H H H H H H H
charge: 0
multiplicity: 1
keywords: wb97x-d3
keywords: def2-TZVPP
keywords: def2/J RIJCOSX
keywords: DEFGRID2
keywords: scfconv7
keywords: smallprint printgap noloewdin
keywords: NOSOSCF
formula: C18H28N2O3
InChI: InChI=1/C18H28N2O3/c1-11(2)16(20-18(22)23-12(3)4)17(21)19-14(6)15-9-7-13(5)8-10-15/h7-12,14,16,19-20H,1-6H3
51 atoms
O  2.074934 -2.082687 -1.471597
O  0.297892 2.673335 0.345944
O  0.211121 1.387886 -1.51063
N  0.937814 -1.342736 0.343559
N  1.894999 1.187685 -0.009277
C  2.563852 0.129377 -0.723077
C  4.025581 -0.022736 -0.266741
C  1.824298 -1.209906 -0.648792
C  0.016574 -2.456381 0.505951
C  4.81453 1.251156 -0.549526
C  4.16853 -0.450238 1.190229
C  -1.392425 -1.954785 0.245149
C  0.219845 -3.114583 1.860743
C  0.749295 1.728721 -0.475062
C  -1.735461 -1.558477 -1.049017
C  -2.349345 -1.820943 1.241235
C  -3.952987 -0.907569 -0.329905
C  -2.989665 -1.049034 -1.331427
C  -3.609885 -1.302931 0.956117
C  -0.981328 3.281655 0.066192
C  -5.30595 -0.343548 -0.645911
C  -0.983594 4.604112 0.801604
C  -2.10287 2.364105 0.513842
H  2.587102 0.379651 -1.787836
H  4.441657 -0.817208 -0.891916
H  0.265315 -3.184875 -0.267084
H  5.877243 1.088644 -0.36519
H  4.500473 2.082093 0.085242
H  4.705243 1.567186 -1.588542
H  5.223929 -0.568214 1.440389
H  3.761414 0.286105 1.88773
H  3.682117 -1.405224 1.39432
H  0.808262 -0.561326 0.969985
H  2.293178 1.548245 0.845225
H  0.069302 -2.414695 2.684453
H  -0.465815 -3.951072 1.997156
H  1.236115 -3.501566 1.935836
H  -1.010419 -1.6538 -1.849837
H  -2.130515 -2.115988 2.259765
H  -3.225348 -0.751796 -2.347246
H  -4.333668 -1.206773 1.75739
H  -1.059639 3.467826 -1.007615
H  -5.900413 -0.195162 0.255247
H  -5.226283 0.619531 -1.153398
H  -5.869199 -1.005101 -1.307427
H  -0.169937 5.250221 0.469006
H  -1.920065 5.127961 0.60883
H  -0.895916 4.464966 1.880857
H  -3.065919 2.836688 0.314793
H  -2.045099 2.161036 1.584893
H  -2.091941 1.413052 -0.018765
elementType: O N C H
totalener: -1038.16501501 hartree
nucrepener: 2090.93252414 hartree
electener: -3129.09753915 hartree
oneelecener: -5567.41964815 hartree
twoeener: 2438.32210900 hartree
cpcmener: -0.04014081 hartree
kineticenergy: 1033.38533123 hartree
xcener: -101.561437979525 hartree
chargesum: 0.0000000
charge: -0.531696 -0.334443 -0.520474 -0.158742 -0.263601 0.097478 0.062021 0.270891 0.187584 -0.298435 -0.306576 -0.033395 -0.305115 0.503699 -0.220224 -0.155704 -0.042507 -0.142440 -0.167637 0.170936 -0.209878 -0.261206 -0.225991 0.106980 0.051049 0.090659 0.097615 0.083428 0.096749 0.101628 0.083703 0.092423 0.169978 0.180532 0.089405 0.108325 0.102705 0.144417 0.142761 0.135770 0.137322 0.066895 0.090606 0.098805 0.105853 0.097195 0.091060 0.088797 0.099833 0.089146 0.041816
qa: -0.5317 -0.3344 -0.5205 -0.1587 -0.2636 0.0975 0.0620 0.2709 0.1876 -0.2984 -0.3066 -0.0334 -0.3051 0.5037 -0.2202 -0.1557 -0.0425 -0.1424 -0.1676 0.1709 -0.2099 -0.2612 -0.2260 0.1070 0.0510 0.0907 0.0976 0.0834 0.0967 0.1016 0.0837 0.0924 0.1700 0.1805 0.0894 0.1083 0.1027 0.1444 0.1428 0.1358 0.1373 0.0669 0.0906 0.0988 0.1059 0.0972 0.0911 0.0888 0.0998 0.0891 0.0418
va: 1.9955 2.0868 1.9868 3.1756 3.1590 3.7862 3.7938 4.2350 3.7087 3.9415 3.9497 3.6938 3.9767 4.3215 3.9215 3.9173 3.7124 3.8536 3.9309 3.8460 3.8976 3.9483 3.8948 1.0373 1.0326 1.0437 1.0042 1.0058 1.0040 1.0041 1.0032 1.0127 1.0264 1.0204 0.9994 1.0018 1.0060 1.0147 1.0001 1.0022 1.0023 1.0214 1.0058 0.9961 0.9951 1.0081 1.0051 1.0060 1.0098 1.0098 1.0344
dispcorr: -0.027974351 hartree
energy: -1038.192989362775
dipole: 0.36091 -0.68360 -0.32268 8.06519 -6.50312 1.56207 10.07051 -7.40347 2.66703
magnitude: 3.10761 au
magnitude: 7.89892 debye
