program: Orca
programVersion: 5.0.2
elementType: O O O N N C C C C C C C C C C C C C C C C C C H H H H H H H H H H H H H H H H H H H H H H H H H H H H
charge: 0
multiplicity: 1
keywords: wb97x-d3
keywords: def2-TZVPP
keywords: def2/J RIJCOSX
keywords: DEFGRID2
keywords: scfconv7
keywords: smallprint printgap noloewdin
keywords: NOSOSCF
formula: C18H28N2O3
InChI: InChI=1/C18H28N2O3/c1-11(2)16(20-18(22)23-12(3)4)17(21)19-14(6)15-9-7-13(5)8-10-15/h7-12,14,16,19-20H,1-6H3
51 atoms
O  2.064283 -2.232294 -1.306981
O  0.342771 2.700622 0.060224
O  0.183476 1.219984 -1.639684
N  0.929887 -1.28487 0.408954
N  1.924562 1.178212 -0.192066
C  2.566706 0.047522 -0.813662
C  4.033657 -0.079273 -0.368376
C  1.817564 -1.269418 -0.590399
C  0.006737 -2.371036 0.69537
C  4.826125 1.167325 -0.747927
C  4.191581 -0.404744 1.113571
C  -1.405838 -1.87736 0.440167
C  0.252752 -2.919038 2.091458
C  0.763323 1.671049 -0.67128
C  -2.316794 -1.617117 1.454187
C  -1.799478 -1.624249 -0.875561
C  -3.979361 -0.870258 -0.143196
C  -3.584855 -1.120525 1.164745
C  -3.060728 -1.134887 -1.161706
C  -0.974488 3.235156 -0.192947
C  -5.338209 -0.323737 -0.464507
C  -0.989337 4.611557 0.435449
C  -2.033529 2.318262 0.389312
H  2.571097 0.193513 -1.89809
H  4.438084 -0.91765 -0.941565
H  0.220523 -3.162622 -0.024188
H  4.541793 2.036574 -0.15107
H  4.688534 1.426558 -1.799607
H  5.892297 1.001868 -0.58647
H  3.715622 -1.348756 1.384318
H  5.249851 -0.496217 1.363887
H  3.779705 0.373725 1.76105
H  0.808852 -0.441238 0.950154
H  2.352258 1.627413 0.60434
H  0.148201 -2.150454 2.858954
H  -0.43994 -3.728087 2.323927
H  1.265208 -3.317475 2.157882
H  -2.055726 -1.799318 2.489264
H  -1.108795 -1.82004 -1.688542
H  -4.274589 -0.927109 1.978393
H  -3.337847 -0.950886 -2.193884
H  -1.118864 3.330358 -1.272004
H  -5.887131 -0.986579 -1.136074
H  -5.940412 -0.189671 0.433751
H  -5.268185 0.645438 -0.962601
H  -1.956754 5.083222 0.260464
H  -0.833552 4.560879 1.514941
H  -0.223558 5.258571 0.004823
H  -1.917173 2.214917 1.469909
H  -2.008636 1.324714 -0.057465
H  -3.023929 2.734247 0.198188
elementType: O N C H
totalener: -1038.16485226 hartree
nucrepener: 2095.00354520 hartree
electener: -3133.16839746 hartree
oneelecener: -5575.53790479 hartree
twoeener: 2442.36950732 hartree
cpcmener: -0.04000014 hartree
kineticenergy: 1033.38792849 hartree
xcener: -101.562339934670 hartree
chargesum: -0.0000000
charge: -0.531694 -0.334779 -0.517605 -0.156787 -0.260623 0.093421 0.063086 0.271094 0.184513 -0.300492 -0.306331 -0.031738 -0.302463 0.497764 -0.153727 -0.217993 -0.041695 -0.171498 -0.140141 0.173825 -0.211340 -0.262678 -0.222726 0.108194 0.051269 0.090009 0.083143 0.097045 0.098196 0.093151 0.101173 0.084346 0.169567 0.180654 0.088547 0.108164 0.102586 0.141965 0.143387 0.137129 0.137154 0.067269 0.104962 0.090737 0.099768 0.090809 0.088774 0.097846 0.089431 0.034280 0.101052
qa: -0.5317 -0.3348 -0.5176 -0.1568 -0.2606 0.0934 0.0631 0.2711 0.1845 -0.3005 -0.3063 -0.0317 -0.3025 0.4978 -0.1537 -0.2180 -0.0417 -0.1715 -0.1401 0.1738 -0.2113 -0.2627 -0.2227 0.1082 0.0513 0.0900 0.0831 0.0970 0.0982 0.0932 0.1012 0.0843 0.1696 0.1807 0.0885 0.1082 0.1026 0.1420 0.1434 0.1371 0.1372 0.0673 0.1050 0.0907 0.0998 0.0908 0.0888 0.0978 0.0894 0.0343 0.1011
va: 1.9966 2.0852 1.9904 3.1752 3.1560 3.7956 3.7885 4.2306 3.7076 3.9442 3.9508 3.6767 3.9776 4.3273 3.9121 3.9180 3.7118 3.9257 3.8500 3.8463 3.8979 3.9501 3.8921 1.0351 1.0331 1.0451 1.0052 1.0041 1.0039 1.0121 1.0042 1.0032 1.0269 1.0204 0.9996 1.0022 1.0059 1.0002 1.0134 1.0025 1.0011 1.0208 0.9960 1.0060 0.9947 1.0050 1.0060 1.0080 1.0098 1.0348 1.0094
dispcorr: -0.028293528 hartree
energy: -1038.193145789472
dipole: 0.53237 -0.82031 -0.28795 8.64577 -6.82643 1.81934 9.50614 -7.02793 2.47820
magnitude: 3.08778 au
magnitude: 7.84851 debye
