program: Orca
programVersion: 5.0.2
elementType: O O O N N C C C C C C C C C C C C C C C C C C H H H H H H H H H H H H H H H H H H H H H H H H H H H H
charge: 0
multiplicity: 1
keywords: wb97x-d3
keywords: def2-TZVPP
keywords: def2/J RIJCOSX
keywords: DEFGRID2
keywords: scfconv7
keywords: smallprint printgap noloewdin
keywords: NOSOSCF
formula: C18H28N2O3
InChI: InChI=1/C18H28N2O3/c1-11(2)16(20-18(22)23-12(3)4)17(21)19-14(6)15-9-7-13(5)8-10-15/h7-12,14,16,19-20H,1-6H3
51 atoms
O  2.061999 -2.117042 -1.420719
O  0.293784 2.657526 0.373326
O  0.190399 1.400357 -1.501421
N  0.937141 -1.333058 0.38267
N  1.893903 1.185927 -0.022102
C  2.544452 0.117713 -0.738564
C  4.018249 -0.027914 -0.322672
C  1.813539 -1.222739 -0.621068
C  0.015664 -2.441327 0.576169
C  4.798341 1.244663 -0.632334
C  4.198395 -0.446452 1.132935
C  -1.388986 -1.950489 0.274329
C  0.201405 -3.042017 1.959615
C  0.739088 1.725486 -0.466795
C  -1.706924 -1.599602 -1.039129
C  -2.362018 -1.777531 1.248381
C  -3.934362 -0.919466 -0.384082
C  -2.953666 -1.097332 -1.36241
C  -3.615502 -1.267847 0.921718
C  -0.984083 3.273235 0.109337
C  -5.282974 -0.373574 -0.746141
C  -0.979251 4.585498 0.862778
C  -2.105655 2.352456 0.549873
H  2.532979 0.354458 -1.806334
H  4.41829 -0.826227 -0.953393
H  0.276554 -3.199702 -0.163525
H  5.862782 1.092729 -0.445937
H  4.478383 2.085154 -0.013667
H  4.685412 1.538695 -1.677869
H  3.834657 0.307579 1.834964
H  3.692581 -1.385745 1.362102
H  5.257483 -0.592185 1.349703
H  0.799695 -0.532463 0.982285
H  2.284205 1.519733 0.846552
H  -0.486022 -3.872121 2.122394
H  1.216598 -3.425252 2.062815
H  0.04127 -2.307759 2.750768
H  -0.967132 -1.725252 -1.821727
H  -2.159547 -2.033515 2.280657
H  -3.170517 -0.835938 -2.391987
H  -4.353673 -1.139514 1.704984
H  -1.067657 3.474817 -0.961342
H  -5.197189 0.548513 -1.323147
H  -5.845754 -1.080676 -1.359107
H  -5.880248 -0.158209 0.13926
H  -0.155356 5.22589 0.5459
H  -1.907784 5.122343 0.667742
H  -0.903152 4.431254 1.940614
H  -2.10122 1.410565 0.001085
H  -3.068578 2.83117 0.366866
H  -2.039538 2.131279 1.616865
elementType: O N C H
totalener: -1038.16507474 hartree
nucrepener: 2092.39206458 hartree
electener: -3130.55713932 hartree
oneelecener: -5570.30901065 hartree
twoeener: 2439.75187133 hartree
cpcmener: -0.03999263 hartree
kineticenergy: 1033.39943623 hartree
xcener: -101.564151555017 hartree
chargesum: -0.0000000
charge: -0.531658 -0.334430 -0.519411 -0.156927 -0.265555 0.102752 0.061044 0.267161 0.190535 -0.299609 -0.305313 -0.033897 -0.305247 0.502129 -0.222495 -0.156027 -0.039973 -0.139772 -0.171056 0.171606 -0.210598 -0.261138 -0.228328 0.107384 0.051199 0.090857 0.097050 0.083538 0.096887 0.083172 0.092230 0.101740 0.169267 0.181082 0.108073 0.102609 0.089215 0.144647 0.142028 0.136409 0.136706 0.066637 0.098834 0.106011 0.090786 0.096880 0.091438 0.088613 0.043908 0.100029 0.088979
qa: -0.5317 -0.3344 -0.5194 -0.1569 -0.2656 0.1028 0.0610 0.2672 0.1905 -0.2996 -0.3053 -0.0339 -0.3052 0.5021 -0.2225 -0.1560 -0.0400 -0.1398 -0.1711 0.1716 -0.2106 -0.2611 -0.2283 0.1074 0.0512 0.0909 0.0971 0.0835 0.0969 0.0832 0.0922 0.1017 0.1693 0.1811 0.1081 0.1026 0.0892 0.1446 0.1420 0.1364 0.1367 0.0666 0.0988 0.1060 0.0908 0.0969 0.0914 0.0886 0.0439 0.1000 0.0890
va: 1.9952 2.0858 1.9878 3.1745 3.1625 3.7868 3.7948 4.2390 3.7070 3.9421 3.9481 3.6916 3.9775 4.3228 3.9269 3.9137 3.7086 3.8605 3.9274 3.8451 3.8971 3.9481 3.8940 1.0368 1.0331 1.0432 1.0042 1.0065 1.0038 1.0030 1.0132 1.0041 1.0273 1.0199 1.0017 1.0063 0.9993 1.0153 1.0003 1.0016 1.0027 1.0215 0.9966 0.9949 1.0056 1.0083 1.0051 1.0058 1.0340 1.0100 1.0095
dispcorr: -0.028000188 hartree
energy: -1038.193074932522
dipole: 0.40688 -0.73116 -0.32428 8.13920 -6.57648 1.56272 9.85576 -7.22464 2.63111
magnitude: 3.07734 au
magnitude: 7.82197 debye
