program: Orca
programVersion: 5.0.2
elementType: O O O N N C C C C C C C C C C C C C C C C C C H H H H H H H H H H H H H H H H H H H H H H H H H H H H
charge: 0
multiplicity: 1
keywords: wb97x-d3
keywords: def2-TZVPP
keywords: def2/J RIJCOSX
keywords: DEFGRID2
keywords: scfconv7
keywords: smallprint printgap noloewdin
keywords: NOSOSCF
formula: C18H28N2O3
InChI: InChI=1/C18H28N2O3/c1-11(2)16(20-18(22)23-12(3)4)17(21)19-14(6)15-9-7-13(5)8-10-15/h7-12,14,16,19-20H,1-6H3
51 atoms
O  2.007508 -2.311257 -0.907629
O  0.750811 3.050395 0.703723
O  0.551331 2.361819 -1.436152
N  0.467787 -1.305481 0.411322
N  1.621048 1.108978 0.13722
C  2.105103 0.074195 -0.742082
C  3.640178 0.052622 -0.825549
C  1.526059 -1.302971 -0.405471
C  -0.273832 -2.490914 0.804369
C  4.158513 1.361595 -1.407498
C  4.301485 -0.24913 0.515181
C  -1.712148 -2.401446 0.342942
C  -0.174964 -2.704111 2.31046
C  0.946216 2.196742 -0.299977
C  -2.539004 -1.355785 0.750803
C  -2.252641 -3.3782 -0.48314
C  -4.406065 -2.272224 -0.490114
C  -3.860068 -1.292388 0.339287
C  -3.579556 -3.316368 -0.890717
C  0.067007 4.292795 0.439706
C  -5.829786 -2.181535 -0.952265
C  1.028851 5.303089 -0.153735
C  -0.501143 4.745743 1.766991
H  1.722933 0.297817 -1.742437
H  3.900602 -0.748336 -1.520829
H  0.193765 -3.337895 0.302387
H  3.706331 1.578169 -2.377323
H  5.23895 1.31381 -1.552962
H  3.958442 2.209581 -0.748968
H  4.133868 0.545614 1.246322
H  3.951714 -1.185888 0.952832
H  5.381982 -0.337163 0.391907
H  0.152722 -0.417568 0.774687
H  1.97957 1.134625 1.081389
H  -0.720852 -3.600346 2.606333
H  0.865606 -2.826279 2.613882
H  -0.592799 -1.860246 2.862638
H  -2.157265 -0.576989 1.402547
H  -1.632996 -4.204318 -0.812893
H  -4.479783 -0.467267 0.671754
H  -3.974033 -4.096212 -1.531938
H  -0.753105 4.10697 -0.257882
H  -5.930263 -1.476019 -1.780302
H  -6.202254 -3.144609 -1.300458
H  -6.489839 -1.834323 -0.156616
H  1.43842 4.969835 -1.107379
H  0.507683 6.244115 -0.333858
H  1.857731 5.504779 0.527139
H  -1.184848 4.004989 2.183618
H  -1.061376 5.670562 1.628486
H  0.286908 4.938455 2.497219
elementType: O N C H
totalener: -1038.16607121 hartree
nucrepener: 1993.61901275 hartree
electener: -3031.78508396 hartree
oneelecener: -5372.18100470 hartree
twoeener: 2340.39592074 hartree
cpcmener: -0.03866609 hartree
kineticenergy: 1033.39799259 hartree
xcener: -101.561327529141 hartree
chargesum: -0.0000000
charge: -0.538518 -0.334291 -0.520144 -0.194045 -0.274237 0.095739 0.075450 0.284187 0.191094 -0.315902 -0.301905 -0.013852 -0.276090 0.519080 -0.199477 -0.161380 -0.013597 -0.186519 -0.169121 0.157091 -0.204960 -0.262948 -0.254036 0.111269 0.038656 0.067161 0.098488 0.102800 0.081775 0.080402 0.096406 0.097857 0.178621 0.177649 0.100195 0.101292 0.091986 0.139092 0.141031 0.139568 0.139797 0.066104 0.103101 0.092401 0.096966 0.094868 0.096974 0.088418 0.096096 0.090915 0.088493
qa: -0.5385 -0.3343 -0.5201 -0.1940 -0.2742 0.0957 0.0754 0.2842 0.1911 -0.3159 -0.3019 -0.0139 -0.2761 0.5191 -0.1995 -0.1614 -0.0136 -0.1865 -0.1691 0.1571 -0.2050 -0.2629 -0.2540 0.1113 0.0387 0.0672 0.0985 0.1028 0.0818 0.0804 0.0964 0.0979 0.1786 0.1776 0.1002 0.1013 0.0920 0.1391 0.1410 0.1396 0.1398 0.0661 0.1031 0.0924 0.0970 0.0949 0.0970 0.0884 0.0961 0.0909 0.0885
va: 1.9859 2.0772 1.9888 3.2211 3.1642 3.7937 3.8311 4.2965 3.7269 3.9430 3.9370 3.6427 3.9558 4.3136 3.9704 3.9611 3.7315 3.9547 3.9256 3.8327 3.9012 3.8977 3.9377 1.0366 1.0419 1.0609 1.0040 1.0039 1.0073 1.0052 1.0101 1.0041 1.0203 1.0215 1.0057 1.0063 1.0013 1.0047 1.0025 1.0010 1.0011 1.0221 0.9933 1.0037 0.9993 1.0186 1.0071 1.0072 1.0080 1.0057 1.0064
dispcorr: -0.023845652 hartree
energy: -1038.189916863250
dipole: 4.07008 -4.82674 -0.75666 11.65973 -10.27743 1.38231 6.46858 -4.28651 2.18207
magnitude: 2.69161 au
magnitude: 6.84152 debye
