program: Orca
programVersion: 5.0.2
elementType: O O O N N C C C C C C C C C C C C C C C C C C H H H H H H H H H H H H H H H H H H H H H H H H H H H H
charge: 0
multiplicity: 1
keywords: wb97x-d3
keywords: def2-TZVPP
keywords: def2/J RIJCOSX
keywords: DEFGRID2
keywords: scfconv7
keywords: smallprint printgap noloewdin
keywords: NOSOSCF
formula: C18H28N2O3
InChI: InChI=1/C18H28N2O3/c1-11(2)16(20-18(22)23-12(3)4)17(21)19-14(6)15-9-7-13(5)8-10-15/h7-12,14,16,19-20H,1-6H3
51 atoms
O  1.77152 -2.259418 -1.067446
O  0.798905 3.109523 0.737092
O  0.45925 2.429665 -1.386908
N  0.471118 -1.285566 0.507353
N  1.571628 1.138487 0.126217
C  1.992619 0.105191 -0.788161
C  3.523904 0.045352 -0.930699
C  1.401252 -1.266241 -0.452419
C  -0.271178 -2.4656 0.914403
C  4.058925 1.365425 -1.471112
C  4.223934 -0.337821 0.368813
C  -1.687811 -2.427555 0.38285
C  -0.238625 -2.602338 2.431536
C  0.910085 2.249833 -0.274137
C  -2.553662 -1.389005 0.720345
C  -2.16464 -3.435593 -0.445034
C  -4.340127 -2.382018 -0.578607
C  -3.855013 -1.366979 0.246177
C  -3.470731 -3.413475 -0.918251
C  0.168683 4.386074 0.501709
C  -5.760824 -2.371033 -1.058654
C  1.158884 5.346107 -0.127195
C  -0.32302 4.865917 1.850008
H  1.579458 0.354742 -1.769286
H  3.734503 -0.729549 -1.671224
H  0.234724 -3.327754 0.479921
H  5.128561 1.289902 -1.673423
H  3.921808 2.183631 -0.76082
H  3.567724 1.647566 -2.404388
H  3.872821 -1.291635 0.766947
H  5.29805 -0.436052 0.204415
H  4.094225 0.418072 1.147397
H  0.208142 -0.40483 0.925546
H  1.998592 1.162798 1.041761
H  -0.785303 -3.491758 2.74504
H  0.78817 -2.694017 2.787986
H  -0.693386 -1.740893 2.92455
H  -2.215094 -0.581424 1.360724
H  -1.509225 -4.251245 -0.728481
H  -4.506484 -0.545619 0.522281
H  -3.814303 -4.212981 -1.564637
H  -0.686029 4.244507 -0.163721
H  -6.116805 -1.356481 -1.239468
H  -5.878578 -2.937614 -1.982243
H  -6.429367 -2.817358 -0.318715
H  2.024528 5.499523 0.519778
H  1.510806 4.995838 -1.097748
H  0.682726 6.31488 -0.28316
H  -0.836715 5.820188 1.73247
H  0.501165 5.014319 2.550112
H  -1.030177 4.162951 2.292083
elementType: O N C H
totalener: -1038.16635711 hartree
nucrepener: 1994.29790760 hartree
electener: -3032.46426472 hartree
oneelecener: -5373.65779464 hartree
twoeener: 2341.19352993 hartree
cpcmener: -0.03925036 hartree
kineticenergy: 1033.39142693 hartree
xcener: -101.559833251009 hartree
chargesum: 0.0000000
charge: -0.541141 -0.333318 -0.519154 -0.193499 -0.275842 0.094403 0.072711 0.286438 0.193811 -0.317316 -0.299115 -0.013475 -0.278613 0.517978 -0.199963 -0.162203 -0.009970 -0.187214 -0.173444 0.156326 -0.206247 -0.262645 -0.253675 0.111784 0.040567 0.070959 0.103602 0.081585 0.099391 0.095620 0.098246 0.081056 0.177460 0.177210 0.100192 0.101846 0.092555 0.138609 0.140519 0.139004 0.139590 0.066336 0.096123 0.094178 0.102557 0.088469 0.094646 0.097268 0.090948 0.088604 0.096242
qa: -0.5411 -0.3333 -0.5192 -0.1935 -0.2758 0.0944 0.0727 0.2864 0.1938 -0.3173 -0.2991 -0.0135 -0.2786 0.5180 -0.2000 -0.1622 -0.0100 -0.1872 -0.1734 0.1563 -0.2062 -0.2626 -0.2537 0.1118 0.0406 0.0710 0.1036 0.0816 0.0994 0.0956 0.0982 0.0811 0.1775 0.1772 0.1002 0.1018 0.0926 0.1386 0.1405 0.1390 0.1396 0.0663 0.0961 0.0942 0.1026 0.0885 0.0946 0.0973 0.0909 0.0886 0.0962
va: 1.9820 2.0779 1.9899 3.2070 3.1553 3.8021 3.8239 4.2891 3.7332 3.9436 3.9385 3.6158 3.9566 4.3174 3.9759 3.9681 3.7267 3.9588 3.9312 3.8338 3.9010 3.8980 3.9367 1.0398 1.0416 1.0507 1.0043 1.0075 1.0042 1.0102 1.0040 1.0048 1.0221 1.0218 1.0056 1.0065 1.0011 1.0051 1.0038 1.0014 1.0011 1.0223 1.0007 1.0027 0.9932 1.0073 1.0179 1.0072 1.0056 1.0064 1.0079
dispcorr: -0.023924830 hartree
energy: -1038.190281940916
dipole: 4.82762 -5.29104 -0.46342 11.44454 -10.09354 1.35100 6.56568 -4.20655 2.35913
magnitude: 2.75779 au
magnitude: 7.00976 debye
