program: Orca
programVersion: 5.0.2
elementType: O O O N N C C C C C C C C C C C C C C C C C C H H H H H H H H H H H H H H H H H H H H H H H H H H H H
charge: 0
multiplicity: 1
keywords: wb97x-d3
keywords: def2-TZVPP
keywords: def2/J RIJCOSX
keywords: DEFGRID2
keywords: scfconv7
keywords: smallprint printgap noloewdin
keywords: NOSOSCF
formula: C18H28N2O3
InChI: InChI=1/C18H28N2O3/c1-11(2)16(20-18(22)23-12(3)4)17(21)19-14(6)15-9-7-13(5)8-10-15/h7-12,14,16,19-20H,1-6H3
51 atoms
O  1.262968 -2.096438 -1.182047
O  0.927861 3.202631 0.280221
O  0.099676 1.960476 -1.41555
N  0.654951 -0.900428 0.630721
N  1.947513 1.324548 -0.260825
C  2.178133 0.104284 -0.991853
C  3.665317 -0.292602 -0.950216
C  1.310148 -1.065734 -0.52287
C  -0.193834 -1.910688 1.223579
C  4.533323 0.784702 -1.588794
C  4.156489 -0.635706 0.452704
C  -1.540159 -2.033462 0.537094
C  -0.370711 -1.5833 2.702344
C  0.919856 2.153478 -0.539246
C  -2.285607 -3.197337 0.71605
C  -2.094879 -1.010927 -0.220176
C  -4.11594 -2.298702 -0.58717
C  -3.549557 -3.327387 0.166527
C  -3.36353 -1.145026 -0.77381
C  -0.146764 4.161733 0.195308
C  -5.484912 -2.448787 -1.181304
C  0.402231 5.457681 0.751119
C  -1.349056 3.661264 0.971187
H  1.912594 0.268707 -2.039681
H  3.745634 -1.193475 -1.563439
H  0.316965 -2.874803 1.145746
H  4.559546 1.700085 -0.994592
H  4.179326 1.045785 -2.587786
H  5.561766 0.433803 -1.68626
H  4.113797 0.216609 1.13559
H  3.592382 -1.452902 0.904964
H  5.199962 -0.95161 0.414625
H  0.739494 -0.017895 1.111054
H  2.585351 1.585978 0.476624
H  -0.986053 -2.338385 3.189518
H  0.592946 -1.555668 3.213617
H  -0.860943 -0.616694 2.836035
H  -1.871187 -4.016191 1.294241
H  -1.541621 -0.096923 -0.397451
H  -4.10531 -4.245209 0.323543
H  -3.770865 -0.329894 -1.36089
H  -0.414464 4.305451 -0.85403
H  -5.511239 -3.247811 -1.924989
H  -6.225541 -2.700308 -0.420161
H  -5.812082 -1.53258 -1.672202
H  -0.359257 6.235007 0.685905
H  0.687222 5.357648 1.8002
H  1.271486 5.799111 0.18751
H  -1.740014 2.72713 0.566863
H  -2.151809 4.397952 0.921832
H  -1.102595 3.505981 2.023305
elementType: O N C H
totalener: -1038.16721581 hartree
nucrepener: 2036.94577367 hartree
electener: -3075.11298948 hartree
oneelecener: -5459.36120486 hartree
twoeener: 2384.24821538 hartree
cpcmener: -0.04187666 hartree
kineticenergy: 1033.39324285 hartree
xcener: -101.561436641148 hartree
chargesum: 0.0000000
charge: -0.526748 -0.334358 -0.521102 -0.173221 -0.269003 0.117721 0.061975 0.246758 0.108222 -0.302267 -0.301862 0.036852 -0.284162 0.505743 -0.184078 -0.152182 -0.003018 -0.186076 -0.197668 0.161879 -0.207192 -0.256443 -0.258566 0.108834 0.050469 0.086019 0.083094 0.096498 0.098694 0.082199 0.093377 0.100842 0.177320 0.182973 0.096105 0.106432 0.096025 0.139444 0.133865 0.138995 0.137410 0.066770 0.101993 0.099804 0.090159 0.091406 0.088465 0.096884 0.089319 0.097942 0.087455
qa: -0.5267 -0.3344 -0.5211 -0.1732 -0.2690 0.1177 0.0620 0.2468 0.1082 -0.3023 -0.3019 0.0369 -0.2842 0.5057 -0.1841 -0.1522 -0.0030 -0.1861 -0.1977 0.1619 -0.2072 -0.2564 -0.2586 0.1088 0.0505 0.0860 0.0831 0.0965 0.0987 0.0822 0.0934 0.1008 0.1773 0.1830 0.0961 0.1064 0.0960 0.1394 0.1339 0.1390 0.1374 0.0668 0.1020 0.0998 0.0902 0.0914 0.0885 0.0969 0.0893 0.0979 0.0875
va: 2.0020 2.0817 1.9850 3.1652 3.1551 3.7930 3.7930 4.2404 3.8055 3.9464 3.9469 3.5334 3.9297 4.3143 3.9750 3.9001 3.7190 3.9358 3.9760 3.8262 3.8996 3.9407 3.9062 1.0366 1.0358 1.0212 1.0066 1.0036 1.0041 1.0034 1.0118 1.0039 1.0189 1.0201 1.0064 1.0064 1.0020 1.0012 1.0136 1.0003 1.0030 1.0225 0.9946 0.9958 1.0060 1.0055 1.0061 1.0078 1.0130 1.0075 1.0081
dispcorr: -0.025536420 hartree
energy: -1038.192752233678
dipole: 3.50384 -2.86153 0.64231 8.99752 -7.31500 1.68252 7.98864 -5.53044 2.45820
magnitude: 3.04733 au
magnitude: 7.74569 debye
