program: Orca
programVersion: 5.0.2
elementType: O O O N N C C C C C C C C C C C C C C C C C C H H H H H H H H H H H H H H H H H H H H H H H H H H H H
charge: 0
multiplicity: 1
keywords: wb97x-d3
keywords: def2-TZVPP
keywords: def2/J RIJCOSX
keywords: DEFGRID2
keywords: scfconv7
keywords: smallprint printgap noloewdin
keywords: NOSOSCF
formula: C18H28N2O3
InChI: InChI=1/C18H28N2O3/c1-11(2)16(20-18(22)23-12(3)4)17(21)19-14(6)15-9-7-13(5)8-10-15/h7-12,14,16,19-20H,1-6H3
51 atoms
O  2.035934 -2.178575 -1.350586
O  0.410107 2.78297 0.245884
O  0.3029 1.538815 -1.636589
N  0.851175 -1.293363 0.365002
N  1.897924 1.180896 -0.065189
C  2.521169 0.081226 -0.757617
C  3.993823 -0.085692 -0.343394
C  1.767232 -1.242813 -0.606484
C  -0.032955 -2.417025 0.623202
C  4.797135 1.164923 -0.680891
C  4.169695 -0.478333 1.119824
C  -1.466832 -2.010162 0.356835
C  0.174269 -2.943927 2.037319
C  0.821279 1.818093 -0.573963
C  -2.18452 -2.580736 -0.686293
C  -2.093202 -1.032602 1.128411
C  -4.116328 -1.208438 -0.190418
C  -3.489831 -2.186969 -0.954753
C  -3.393859 -0.639761 0.858418
C  -0.750081 3.560405 -0.120367
C  -5.528768 -0.785598 -0.464253
C  -0.653573 4.847479 0.669763
C  -2.020222 2.791628 0.18447
H  2.51148 0.296168 -1.82978
H  4.377424 -0.904154 -0.957924
H  0.237765 -3.202327 -0.082528
H  5.860843 0.988823 -0.514544
H  4.510323 2.018693 -0.064103
H  4.670823 1.45248 -1.726362
H  3.663064 -1.413124 1.364378
H  5.228077 -0.620959 1.342271
H  3.805142 0.287867 1.808385
H  0.718859 -0.468955 0.932433
H  2.280955 1.501432 0.811957
H  1.201609 -3.2841 2.172598
H  -0.029253 -2.178561 2.788177
H  -0.488243 -3.787377 2.231956
H  -1.719018 -3.339445 -1.304828
H  -1.563907 -0.560516 1.949128
H  -4.023591 -2.64604 -1.77887
H  -3.854677 0.1281 1.469614
H  -0.701365 3.788901 -1.187821
H  -6.224457 -1.255186 0.234968
H  -5.651136 0.292992 -0.358946
H  -5.844359 -1.061311 -1.470161
H  0.269161 5.385973 0.449586
H  -1.486579 5.500178 0.408683
H  -0.698344 4.66377 1.744888
H  -2.079261 2.535763 1.243974
H  -2.09675 1.875528 -0.400036
H  -2.887321 3.407209 -0.058592
elementType: O N C H
totalener: -1038.16554795 hartree
nucrepener: 2062.93712966 hartree
electener: -3101.10267761 hartree
oneelecener: -5511.19534359 hartree
twoeener: 2410.09266598 hartree
cpcmener: -0.04236446 hartree
kineticenergy: 1033.39888917 hartree
xcener: -101.561835583623 hartree
chargesum: 0.0000000
charge: -0.533528 -0.333789 -0.522707 -0.175839 -0.269020 0.092873 0.062963 0.271623 0.188807 -0.299982 -0.302517 -0.008390 -0.285941 0.511662 -0.153298 -0.191974 0.022388 -0.175613 -0.244233 0.168074 -0.204948 -0.256899 -0.270927 0.107912 0.050315 0.067886 0.097906 0.082830 0.096998 0.092782 0.101058 0.082859 0.174514 0.180816 0.101909 0.091914 0.101608 0.140787 0.141964 0.139133 0.141885 0.067648 0.103267 0.096668 0.092461 0.096902 0.091072 0.088531 0.086800 0.089242 0.103547
qa: -0.5335 -0.3338 -0.5227 -0.1758 -0.2690 0.0929 0.0630 0.2716 0.1888 -0.3000 -0.3025 -0.0084 -0.2859 0.5117 -0.1533 -0.1920 0.0224 -0.1756 -0.2442 0.1681 -0.2049 -0.2569 -0.2709 0.1079 0.0503 0.0679 0.0979 0.0828 0.0970 0.0928 0.1011 0.0829 0.1745 0.1808 0.1019 0.0919 0.1016 0.1408 0.1420 0.1391 0.1419 0.0676 0.1033 0.0967 0.0925 0.0969 0.0911 0.0885 0.0868 0.0892 0.1035
va: 1.9995 2.0831 1.9855 3.2009 3.1584 3.7881 3.7922 4.2560 3.7356 3.9463 3.9490 3.6074 3.9606 4.3135 3.9538 3.9032 3.6903 3.9387 3.9231 3.8359 3.9015 3.9417 3.8889 1.0387 1.0356 1.0586 1.0043 1.0065 1.0038 1.0119 1.0041 1.0032 1.0238 1.0205 1.0049 1.0015 1.0063 1.0032 1.0044 1.0010 0.9993 1.0203 0.9936 0.9985 1.0043 1.0081 1.0057 1.0059 1.0062 1.0183 1.0083
dispcorr: -0.026508143 hartree
energy: -1038.192056091316
dipole: 0.65465 -1.04191 -0.38726 8.68944 -7.04682 1.64262 9.52576 -6.89438 2.63138
magnitude: 3.12607 au
magnitude: 7.94584 debye
