program: Orca
programVersion: 5.0.2
elementType: O O O N N C C C C C C C C C C C C C C C C C C H H H H H H H H H H H H H H H H H H H H H H H H H H H H
charge: 0
multiplicity: 1
keywords: wb97x-d3
keywords: def2-TZVPP
keywords: def2/J RIJCOSX
keywords: DEFGRID2
keywords: scfconv7
keywords: smallprint printgap noloewdin
keywords: NOSOSCF
formula: C18H28N2O3
InChI: InChI=1/C18H28N2O3/c1-11(2)16(20-18(22)23-12(3)4)17(21)19-14(6)15-9-7-13(5)8-10-15/h7-12,14,16,19-20H,1-6H3
51 atoms
O  1.255867 -2.149357 -1.061464
O  0.895505 3.273572 0.67635
O  0.203499 2.436007 -1.299507
N  0.459397 -1.110247 0.775158
N  1.582649 1.263287 0.080263
C  1.819608 0.156181 -0.812963
C  3.320905 -0.060786 -1.075432
C  1.146698 -1.142699 -0.370785
C  -0.292474 -2.249126 1.272428
C  3.934146 1.180848 -1.709696
C  4.091465 -0.477521 0.172978
C  -1.621973 -2.392483 0.561827
C  -0.464004 -2.120335 2.778539
C  0.842914 2.339633 -0.271401
C  -1.948164 -3.565502 -0.104228
C  -2.558051 -1.359655 0.574476
C  -4.119422 -2.687271 -0.716848
C  -3.180114 -3.712077 -0.731761
C  -3.783719 -1.506068 -0.052773
C  0.216076 4.52758 0.450516
C  -5.444412 -2.828248 -1.405182
C  1.082076 5.440658 -0.393487
C  -0.073145 5.105833 1.81877
H  1.353508 0.404421 -1.769672
H  3.386381 -0.875452 -1.800406
H  0.298103 -3.145378 1.071718
H  4.96919 0.990089 -1.998697
H  3.940728 2.029898 -1.022665
H  3.392233 1.483125 -2.608247
H  4.100633 0.303965 0.937441
H  3.69138 -1.385653 0.628148
H  5.133928 -0.678934 -0.079169
H  0.356314 -0.22454 1.248452
H  2.152964 1.341203 0.910504
H  -1.00308 -2.981984 3.171573
H  0.505906 -2.075459 3.276759
H  -1.026841 -1.224185 3.047846
H  -1.236502 -4.382823 -0.132862
H  -2.33342 -0.426752 1.079859
H  -3.408495 -4.640802 -1.241995
H  -4.495279 -0.688368 -0.024616
H  -0.728419 4.333098 -0.062553
H  -5.654557 -3.86538 -1.665555
H  -6.262003 -2.469272 -0.778382
H  -5.474416 -2.247324 -2.32981
H  1.290933 5.015946 -1.375678
H  0.569283 6.390279 -0.551882
H  2.031966 5.652262 0.100985
H  -0.613802 6.046312 1.708457
H  0.844079 5.311656 2.373795
H  -0.695908 4.435958 2.413191
elementType: O N C H
totalener: -1038.16720953 hartree
nucrepener: 2000.76499413 hartree
electener: -3038.93220366 hartree
oneelecener: -5386.96285890 hartree
twoeener: 2348.03065524 hartree
cpcmener: -0.04076166 hartree
kineticenergy: 1033.38889588 hartree
xcener: -101.558900949655 hartree
chargesum: -0.0000000
charge: -0.536154 -0.335187 -0.523284 -0.189261 -0.283362 0.105408 0.064491 0.271163 0.181744 -0.315967 -0.298387 0.010132 -0.280298 0.524773 -0.178202 -0.200012 -0.015599 -0.169104 -0.193008 0.156923 -0.207851 -0.262582 -0.251588 0.111747 0.045299 0.082604 0.103028 0.081908 0.099943 0.081032 0.096367 0.098807 0.176920 0.179908 0.100624 0.105169 0.092336 0.138071 0.138912 0.139208 0.140108 0.065409 0.091256 0.098236 0.103454 0.094881 0.096932 0.088294 0.090626 0.088338 0.095797
qa: -0.5362 -0.3352 -0.5233 -0.1893 -0.2834 0.1054 0.0645 0.2712 0.1817 -0.3160 -0.2984 0.0101 -0.2803 0.5248 -0.1782 -0.2000 -0.0156 -0.1691 -0.1930 0.1569 -0.2079 -0.2626 -0.2516 0.1117 0.0453 0.0826 0.1030 0.0819 0.0999 0.0810 0.0964 0.0988 0.1769 0.1799 0.1006 0.1052 0.0923 0.1381 0.1389 0.1392 0.1401 0.0654 0.0913 0.0982 0.1035 0.0949 0.0969 0.0883 0.0906 0.0883 0.0958
va: 1.9891 2.0793 1.9857 3.1906 3.1564 3.7976 3.8148 4.2868 3.7771 3.9445 3.9388 3.5025 3.9430 4.3095 3.9941 3.9744 3.7356 3.9291 3.9568 3.8328 3.9024 3.9021 3.9347 1.0459 1.0402 1.0255 1.0042 1.0082 1.0033 1.0040 1.0098 1.0039 1.0235 1.0202 1.0056 1.0063 1.0008 1.0067 1.0064 1.0011 1.0007 1.0235 1.0048 0.9980 0.9934 1.0177 1.0068 1.0071 1.0057 1.0065 1.0080
dispcorr: -0.024104035 hartree
energy: -1038.191313569460
dipole: 5.88880 -5.66361 0.22519 11.10674 -9.63613 1.47061 5.09632 -2.72253 2.37380
magnitude: 2.80148 au
magnitude: 7.12080 debye
