program: Orca
programVersion: 5.0.2
elementType: O O O N N C C C C C C C C C C C C C C C C C C H H H H H H H H H H H H H H H H H H H H H H H H H H H H
charge: 0
multiplicity: 1
keywords: wb97x-d3
keywords: def2-TZVPP
keywords: def2/J RIJCOSX
keywords: DEFGRID2
keywords: scfconv7
keywords: smallprint printgap noloewdin
keywords: NOSOSCF
formula: C18H28N2O3
InChI: InChI=1/C18H28N2O3/c1-11(2)16(20-18(22)23-12(3)4)17(21)19-14(6)15-9-7-13(5)8-10-15/h7-12,14,16,19-20H,1-6H3
51 atoms
O  1.300294 -2.164664 -1.031823
O  0.906856 3.27446 0.675404
O  0.222463 2.439763 -1.304413
N  0.448749 -1.108329 0.769617
N  1.586845 1.260155 0.084223
C  1.828071 0.151843 -0.806258
C  3.330062 -0.057218 -1.073603
C  1.163334 -1.149217 -0.358881
C  -0.303792 -2.245946 1.268418
C  3.93156 1.183301 -1.720777
C  4.108313 -0.458942 0.174745
C  -1.63086 -2.393184 0.554484
C  -0.481359 -2.110675 2.773678
C  0.855341 2.340821 -0.2727
C  -1.950475 -3.56409 -0.118523
C  -2.573252 -1.366167 0.573819
C  -4.129519 -2.696964 -0.720028
C  -3.183007 -3.714934 -0.744156
C  -3.799413 -1.516965 -0.05126
C  0.222615 4.527053 0.4529
C  -5.457016 -2.844267 -1.402069
C  1.082153 5.444897 -0.392447
C  -0.062601 5.102791 1.823199
H  1.35789 0.394465 -1.762439
H  3.397868 -0.877146 -1.792169
H  0.288289 -3.14248 1.074093
H  4.965977 0.997235 -2.014819
H  3.936544 2.037693 -1.040434
H  3.382247 1.47501 -2.61817
H  4.115702 0.328762 0.932638
H  3.715202 -1.365667 0.638722
H  5.150668 -0.656665 -0.080348
H  0.330084 -0.218043 1.230331
H  2.145813 1.331033 0.922664
H  -1.026503 -2.96781 3.16793
H  0.486618 -2.068326 3.275454
H  -1.040693 -1.210536 3.036858
H  -1.234176 -4.377063 -0.15353
H  -2.353673 -0.434698 1.083966
H  -3.406399 -4.642506 -1.258672
H  -4.516029 -0.703997 -0.016409
H  -0.723098 4.329797 -0.056925
H  -5.495123 -2.26226 -2.325683
H  -5.66287 -3.882142 -1.662539
H  -6.273225 -2.490605 -0.770556
H  1.286665 5.025066 -1.377533
H  0.566296 6.394062 -0.543724
H  2.034054 5.656852 0.09794
H  -0.682282 4.431665 2.419208
H  -0.604217 6.043036 1.716545
H  0.856662 5.308673 2.37474
elementType: O N C H
totalener: -1038.16721492 hartree
nucrepener: 1999.37574888 hartree
electener: -3037.54296379 hartree
oneelecener: -5384.16008610 hartree
twoeener: 2346.61712231 hartree
cpcmener: -0.04059021 hartree
kineticenergy: 1033.38960954 hartree
xcener: -101.559129228423 hartree
chargesum: 0.0000000
charge: -0.537161 -0.335035 -0.523061 -0.189783 -0.282980 0.106924 0.064383 0.271611 0.184108 -0.316032 -0.298468 0.006129 -0.280620 0.524436 -0.176336 -0.198516 -0.014466 -0.170226 -0.193939 0.156830 -0.207810 -0.262588 -0.251806 0.111696 0.044714 0.082452 0.103176 0.081828 0.099750 0.080925 0.096600 0.098679 0.176806 0.179675 0.100850 0.105106 0.092155 0.138188 0.139128 0.139123 0.140005 0.065536 0.103469 0.091342 0.098204 0.094907 0.096889 0.088313 0.095837 0.090629 0.088422
qa: -0.5372 -0.3350 -0.5231 -0.1898 -0.2830 0.1069 0.0644 0.2716 0.1841 -0.3160 -0.2985 0.0061 -0.2806 0.5244 -0.1763 -0.1985 -0.0145 -0.1702 -0.1939 0.1568 -0.2078 -0.2626 -0.2518 0.1117 0.0447 0.0825 0.1032 0.0818 0.0997 0.0809 0.0966 0.0987 0.1768 0.1797 0.1009 0.1051 0.0922 0.1382 0.1391 0.1391 0.1400 0.0655 0.1035 0.0913 0.0982 0.0949 0.0969 0.0883 0.0958 0.0906 0.0884
va: 1.9871 2.0795 1.9859 3.1936 3.1568 3.7977 3.8171 4.2893 3.7740 3.9440 3.9385 3.5081 3.9437 4.3096 3.9922 3.9739 3.7342 3.9304 3.9580 3.8330 3.9022 3.9014 3.9349 1.0450 1.0408 1.0263 1.0042 1.0082 1.0034 1.0042 1.0096 1.0039 1.0233 1.0202 1.0056 1.0063 1.0009 1.0068 1.0062 1.0012 1.0008 1.0232 0.9934 1.0048 0.9980 1.0179 1.0067 1.0071 1.0080 1.0057 1.0065
dispcorr: -0.024058815 hartree
energy: -1038.191273730393
dipole: 5.74307 -5.59340 0.14967 11.16211 -9.68529 1.47682 5.06618 -2.70745 2.35873
magnitude: 2.78694 au
magnitude: 7.08383 debye
