program: Orca
programVersion: 5.0.2
elementType: O O O N N C C C C C C C C C C C C C C C C C C H H H H H H H H H H H H H H H H H H H H H H H H H H H H
charge: 0
multiplicity: 1
keywords: wb97x-d3
keywords: def2-TZVPP
keywords: def2/J RIJCOSX
keywords: DEFGRID2
keywords: scfconv7
keywords: smallprint printgap noloewdin
keywords: NOSOSCF
formula: C18H28N2O3
InChI: InChI=1/C18H28N2O3/c1-11(2)16(20-18(22)23-12(3)4)17(21)19-14(6)15-9-7-13(5)8-10-15/h7-12,14,16,19-20H,1-6H3
51 atoms
O  1.684112 -2.250267 -1.112192
O  0.893851 3.082225 0.671022
O  0.398157 2.269212 -1.3741
N  0.609461 -1.200915 0.577934
N  1.792838 1.168228 0.048229
C  2.128716 0.081033 -0.836525
C  3.649737 -0.095342 -0.985894
C  1.449971 -1.238718 -0.461125
C  -0.217098 -2.318229 0.99867
C  4.27521 1.156657 -1.586297
C  4.334233 -0.480582 0.321078
C  -1.601908 -2.231241 0.392349
C  -0.267167 -2.374394 2.51973
C  0.977525 2.185247 -0.310258
C  -2.404435 -1.109416 0.598848
C  -2.11132 -3.26948 -0.374651
C  -4.192977 -2.080738 -0.713797
C  -3.675244 -1.036747 0.05506
C  -3.388808 -3.195587 -0.91949
C  0.025328 4.221859 0.499304
C  -5.577478 -1.996019 -1.284354
C  0.539776 5.288293 1.442451
C  -1.410336 3.834823 0.794056
H  1.72987 0.32992 -1.823571
H  3.791402 -0.913825 -1.695397
H  0.260503 -3.228839 0.635562
H  5.336287 0.997155 -1.784681
H  4.195027 2.014639 -0.915796
H  3.8012 1.427329 -2.531931
H  5.393641 -0.675187 0.14745
H  4.280963 0.314864 1.068813
H  3.911439 -1.384914 0.763341
H  0.449146 -0.310591 1.025733
H  2.277704 1.241809 0.931337
H  -0.705859 -1.468603 2.943136
H  -0.870986 -3.22011 2.848248
H  0.734308 -2.493604 2.935306
H  -2.038334 -0.275998 1.188887
H  -1.505493 -4.150214 -0.554998
H  -4.277276 -0.151978 0.229393
H  -3.759173 -4.0202 -1.517554
H  0.109873 4.581473 -0.528926
H  -5.773542 -2.805018 -1.987425
H  -6.334139 -2.053561 -0.498893
H  -5.737334 -1.052648 -1.80887
H  0.473787 4.971234 2.484827
H  1.576289 5.549545 1.224995
H  -0.05774 6.193239 1.331395
H  -2.056646 4.705387 0.675466
H  -1.519272 3.475318 1.81909
H  -1.776368 3.063077 0.116561
elementType: O N C H
totalener: -1038.16665378 hartree
nucrepener: 2015.75260442 hartree
electener: -3053.91925820 hartree
oneelecener: -5416.65660074 hartree
twoeener: 2362.73734254 hartree
cpcmener: -0.04025081 hartree
kineticenergy: 1033.38895251 hartree
xcener: -101.559364699698 hartree
chargesum: -0.0000000
charge: -0.540312 -0.335778 -0.523298 -0.190180 -0.277002 0.099266 0.063141 0.280558 0.186877 -0.314092 -0.298028 0.001138 -0.277877 0.525336 -0.202332 -0.167055 -0.011820 -0.194174 -0.169862 0.160181 -0.207477 -0.253154 -0.265139 0.111081 0.043169 0.074343 0.102101 0.082976 0.098654 0.098688 0.080966 0.096382 0.175086 0.180245 0.092267 0.100063 0.102747 0.139779 0.139760 0.139103 0.140361 0.065824 0.091013 0.102169 0.099967 0.088151 0.096454 0.090817 0.098623 0.087080 0.093215
qa: -0.5403 -0.3358 -0.5233 -0.1902 -0.2770 0.0993 0.0631 0.2806 0.1869 -0.3141 -0.2980 0.0011 -0.2779 0.5253 -0.2023 -0.1671 -0.0118 -0.1942 -0.1699 0.1602 -0.2075 -0.2532 -0.2651 0.1111 0.0432 0.0743 0.1021 0.0830 0.0987 0.0987 0.0810 0.0964 0.1751 0.1802 0.0923 0.1001 0.1027 0.1398 0.1398 0.1391 0.1404 0.0658 0.0910 0.1022 0.1000 0.0882 0.0965 0.0908 0.0986 0.0871 0.0932
va: 1.9822 2.0774 1.9853 3.1997 3.1642 3.8007 3.8224 4.2784 3.7488 3.9427 3.9381 3.5762 3.9518 4.3012 3.9729 3.9748 3.7343 3.9639 3.9255 3.8308 3.9023 3.9367 3.9000 1.0426 1.0413 1.0430 1.0040 1.0081 1.0028 1.0040 1.0041 1.0093 1.0247 1.0200 1.0006 1.0058 1.0068 1.0029 1.0045 1.0014 1.0010 1.0217 1.0053 0.9940 0.9970 1.0064 1.0082 1.0055 1.0073 1.0073 1.0194
dispcorr: -0.024360187 hartree
energy: -1038.191013969063
dipole: 2.38156 -2.62804 -0.24648 9.72198 -8.28370 1.43828 7.24416 -4.83055 2.41360
magnitude: 2.82044 au
magnitude: 7.16899 debye
