program: Orca
programVersion: 5.0.2
elementType: O O O N N C C C C C C C C C C C C C C C C C C H H H H H H H H H H H H H H H H H H H H H H H H H H H H
charge: 0
multiplicity: 1
keywords: wb97x-d3
keywords: def2-TZVPP
keywords: def2/J RIJCOSX
keywords: DEFGRID2
keywords: scfconv7
keywords: smallprint printgap noloewdin
keywords: NOSOSCF
formula: C18H28N2O3
InChI: InChI=1/C18H28N2O3/c1-11(2)16(20-18(22)23-12(3)4)17(21)19-14(6)15-9-7-13(5)8-10-15/h7-12,14,16,19-20H,1-6H3
51 atoms
O  1.246807 -1.959478 -1.49223
O  0.756442 3.069137 0.589644
O  0.05091 1.956218 -1.246214
N  0.740783 -1.137389 0.548124
N  1.867804 1.279714 -0.07042
C  2.176455 0.167618 -0.933346
C  3.673739 -0.18702 -0.880839
C  1.328826 -1.072607 -0.651466
C  -0.104647 -2.246219 0.953812
C  4.523528 0.979918 -1.370441
C  4.136246 -0.668909 0.490626
C  -1.494664 -2.12417 0.36758
C  -0.1326 -2.324775 2.473629
C  0.821745 2.096513 -0.317869
C  -2.280697 -1.002275 0.618776
C  -2.021625 -3.131968 -0.429148
C  -4.097674 -1.916557 -0.695872
C  -3.560217 -0.901981 0.096278
C  -3.304673 -3.030879 -0.95165
C  -0.267693 4.078351 0.458904
C  -5.495083 -1.820302 -1.232399
C  0.21927 5.265704 1.262548
C  -1.602111 3.557473 0.954373
H  1.947318 0.450648 -1.964297
H  3.802074 -1.012353 -1.586254
H  0.347489 -3.164515 0.57267
H  5.567166 0.676231 -1.465072
H  4.494506 1.827928 -0.683327
H  4.193751 1.332762 -2.349344
H  3.586927 -1.547094 0.832393
H  5.190182 -0.947293 0.45028
H  4.046306 0.101647 1.260512
H  0.825475 -0.350011 1.174133
H  2.491813 1.511715 0.687807
H  -0.54912 -1.418725 2.918335
H  -0.745681 -3.165377 2.79676
H  0.872447 -2.469184 2.873029
H  -1.895206 -0.191398 1.227238
H  -1.423857 -4.009469 -0.648171
H  -4.150961 -0.017155 0.304987
H  -3.688998 -3.830699 -1.574383
H  -0.349052 4.364917 -0.592799
H  -5.598892 -2.343988 -2.182793
H  -6.213618 -2.265563 -0.540058
H  -5.797053 -0.784044 -1.38541
H  0.319503 5.02005 2.321465
H  1.181502 5.629442 0.899644
H  -0.49586 6.083913 1.177068
H  -2.348672 4.350249 0.890871
H  -1.539579 3.241686 1.997619
H  -1.965584 2.719807 0.359758
elementType: O N C H
totalener: -1038.16657331 hartree
nucrepener: 2041.20559242 hartree
electener: -3079.37216573 hartree
oneelecener: -5468.14136940 hartree
twoeener: 2388.76920367 hartree
cpcmener: -0.04403287 hartree
kineticenergy: 1033.39474658 hartree
xcener: -101.559818626898 hartree
chargesum: 0.0000000
charge: -0.527999 -0.335536 -0.523554 -0.184781 -0.273387 0.111887 0.061416 0.258906 0.164954 -0.299992 -0.304067 0.033748 -0.283591 0.515137 -0.224271 -0.178700 -0.014846 -0.184627 -0.170015 0.164807 -0.207519 -0.256562 -0.266598 0.107426 0.050417 0.082168 0.098353 0.083432 0.096819 0.091905 0.101803 0.082967 0.176937 0.181682 0.092569 0.100525 0.106959 0.144696 0.136396 0.138000 0.139575 0.066767 0.095442 0.102021 0.094391 0.088551 0.096511 0.091084 0.099972 0.087543 0.090280
qa: -0.5280 -0.3355 -0.5236 -0.1848 -0.2734 0.1119 0.0614 0.2589 0.1650 -0.3000 -0.3041 0.0337 -0.2836 0.5151 -0.2243 -0.1787 -0.0148 -0.1846 -0.1700 0.1648 -0.2075 -0.2566 -0.2666 0.1074 0.0504 0.0822 0.0984 0.0834 0.0968 0.0919 0.1018 0.0830 0.1769 0.1817 0.0926 0.1005 0.1070 0.1447 0.1364 0.1380 0.1396 0.0668 0.0954 0.1020 0.0944 0.0886 0.0965 0.0911 0.1000 0.0875 0.0903
va: 2.0037 2.0815 1.9832 3.1856 3.1614 3.7822 3.7966 4.2578 3.7889 3.9447 3.9461 3.4847 3.9468 4.3076 3.9784 3.9880 3.7379 3.9517 3.9285 3.8268 3.9020 3.9413 3.8938 1.0422 1.0336 1.0253 1.0044 1.0062 1.0037 1.0139 1.0041 1.0031 1.0221 1.0203 0.9999 1.0062 1.0049 0.9991 1.0074 1.0020 1.0005 1.0196 1.0016 0.9930 1.0022 1.0062 1.0078 1.0057 1.0078 1.0072 1.0209
dispcorr: -0.025410464 hartree
energy: -1038.191983773665
dipole: 3.52570 -2.87290 0.65280 8.45554 -7.03112 1.42442 8.68325 -6.02138 2.66188
magnitude: 3.08880 au
magnitude: 7.85112 debye
