program: Orca
programVersion: 5.0.2
elementType: O O O N N C C C C C C C C C C C C C C C C C C H H H H H H H H H H H H H H H H H H H H H H H H H H H H
charge: 0
multiplicity: 1
keywords: wb97x-d3
keywords: def2-TZVPP
keywords: def2/J RIJCOSX
keywords: DEFGRID2
keywords: scfconv7
keywords: smallprint printgap noloewdin
keywords: NOSOSCF
formula: C18H28N2O3
InChI: InChI=1/C18H28N2O3/c1-11(2)16(20-18(22)23-12(3)4)17(21)19-14(6)15-9-7-13(5)8-10-15/h7-12,14,16,19-20H,1-6H3
51 atoms
O  0.595446 -0.41592 -1.600145
O  3.256883 3.039327 -0.722495
O  2.793965 2.39724 1.392089
N  -0.014092 -1.367198 0.362105
N  1.45547 1.828436 -0.358637
C  0.550562 0.975438 0.365122
C  -0.827121 1.629468 0.612532
C  0.391121 -0.34033 -0.395685
C  -0.310005 -2.700741 -0.135225
C  -0.679002 2.877367 1.473158
C  -1.569085 1.945173 -0.681042
C  -1.788357 -3.005625 -0.02728
C  0.541076 -3.731505 0.596338
C  2.524086 2.42021 0.206154
C  -2.43786 -2.990193 1.20444
C  -2.532854 -3.320916 -1.158156
C  -4.539063 -3.601671 0.167011
C  -3.790407 -3.280861 1.298102
C  -3.886256 -3.61507 -1.062533
C  4.46268 3.719394 -0.32125
C  -5.994437 -3.949198 0.271358
C  4.141292 5.120866 0.158367
C  5.368844 3.717842 -1.53435
H  0.996908 0.762322 1.338902
H  -1.419258 0.901977 1.177428
H  -0.034845 -2.711197 -1.189716
H  -0.121553 3.661087 0.956583
H  -0.167163 2.663962 2.413159
H  -1.660129 3.286401 1.719649
H  -1.003216 2.632242 -1.314395
H  -1.791512 1.052576 -1.267548
H  -2.523213 2.425884 -0.459994
H  -0.122958 -1.212803 1.354386
H  1.359643 1.868982 -1.362432
H  0.3328 -4.733827 0.222009
H  1.602256 -3.528499 0.447596
H  0.342243 -3.727915 1.669765
H  -1.889895 -2.748951 2.109004
H  -2.051614 -3.335364 -2.129458
H  -4.272138 -3.258879 2.268926
H  -4.442399 -3.855495 -1.961541
H  4.940673 3.154986 0.482786
H  -6.139992 -5.031698 0.291775
H  -6.440309 -3.546185 1.180576
H  -6.561206 -3.566898 -0.578035
H  3.486573 5.115476 1.030101
H  5.061704 5.63197 0.443557
H  3.664407 5.707817 -0.628911
H  6.312244 4.205805 -1.288914
H  4.922617 4.257785 -2.371535
H  5.597646 2.702548 -1.861082
elementType: O N C H
totalener: -1038.16607136 hartree
nucrepener: 1955.62700665 hartree
electener: -2993.79307801 hartree
oneelecener: -5296.70875590 hartree
twoeener: 2302.91567790 hartree
cpcmener: -0.03698831 hartree
kineticenergy: 1033.38881100 hartree
xcener: -101.558574973749 hartree
chargesum: 0.0000000
charge: -0.528442 -0.339929 -0.539965 -0.196171 -0.252720 0.107736 0.076936 0.287043 0.194586 -0.315467 -0.308782 -0.009465 -0.277644 0.512359 -0.203846 -0.167676 -0.011786 -0.180468 -0.172103 0.156521 -0.203898 -0.262132 -0.254227 0.111545 0.044863 0.071483 0.085705 0.097661 0.101266 0.086658 0.092193 0.096717 0.171657 0.169713 0.099557 0.102563 0.092285 0.139515 0.140582 0.139356 0.139991 0.063274 0.102425 0.092569 0.097105 0.093075 0.095875 0.087521 0.090054 0.088143 0.096187
qa: -0.5284 -0.3399 -0.5400 -0.1962 -0.2527 0.1077 0.0769 0.2870 0.1946 -0.3155 -0.3088 -0.0095 -0.2776 0.5124 -0.2038 -0.1677 -0.0118 -0.1805 -0.1721 0.1565 -0.2039 -0.2621 -0.2542 0.1115 0.0449 0.0715 0.0857 0.0977 0.1013 0.0867 0.0922 0.0967 0.1717 0.1697 0.0996 0.1026 0.0923 0.1395 0.1406 0.1394 0.1400 0.0633 0.1024 0.0926 0.0971 0.0931 0.0959 0.0875 0.0901 0.0881 0.0962
va: 1.9793 2.0832 1.9625 3.2418 3.1980 3.7721 3.7910 4.2803 3.7333 3.9402 3.9457 3.6303 3.9596 4.3168 3.9643 3.9588 3.7306 3.9492 3.9311 3.8391 3.9001 3.9038 3.9370 1.0431 1.0278 1.0531 1.0054 1.0061 1.0055 1.0064 1.0122 1.0044 1.0091 1.0407 1.0053 1.0058 1.0013 1.0045 1.0033 1.0013 1.0007 1.0237 0.9935 1.0035 0.9999 1.0183 1.0066 1.0075 1.0055 1.0069 1.0079
dispcorr: -0.023586484 hartree
energy: -1038.189657839072
dipole: -1.78012 0.77079 -1.00933 8.47469 -9.12028 -0.64559 2.48524 -1.72858 0.75665
magnitude: 1.41706 au
magnitude: 3.60188 debye
