program: Orca
programVersion: 5.0.2
elementType: O O O N N C C C C C C C C C C C C C C C C C C H H H H H H H H H H H H H H H H H H H H H H H H H H H H
charge: 0
multiplicity: 1
keywords: wb97x-d3
keywords: def2-TZVPP
keywords: def2/J RIJCOSX
keywords: DEFGRID2
keywords: scfconv7
keywords: smallprint printgap noloewdin
keywords: NOSOSCF
formula: C18H28N2O3
InChI: InChI=1/C18H28N2O3/c1-11(2)16(20-18(22)23-12(3)4)17(21)19-14(6)15-9-7-13(5)8-10-15/h7-12,14,16,19-20H,1-6H3
51 atoms
O  -0.764471 0.128003 -1.231227
O  1.712095 3.789095 -0.924494
O  3.278024 2.284134 -0.309569
N  0.486146 -1.689285 -0.769701
N  1.053388 1.819592 -0.19346
C  1.173475 0.431277 0.165097
C  0.906989 0.163245 1.664705
C  0.207803 -0.381928 -0.691421
C  -0.435617 -2.653117 -1.345993
C  1.90373 0.919686 2.533215
C  -0.524807 0.485343 2.075275
C  -1.613046 -2.903038 -0.427549
C  0.316651 -3.936785 -1.664431
C  2.113964 2.603223 -0.463136
C  -2.917367 -2.806971 -0.89679
C  -1.416389 -3.2492 0.90595
C  -3.804843 -3.408263 1.273862
C  -3.996216 -3.058958 -0.060751
C  -2.495293 -3.498139 1.741114
C  2.703412 4.7902 -1.229231
C  -4.973288 -3.658118 2.180717
C  3.104383 5.53112 0.031011
C  2.076379 5.701278 -2.2630
H  2.194014 0.108012 -0.054383
H  1.074562 -0.907504 1.821504
H  -0.811941 -2.238127 -2.283518
H  1.772621 0.646745 3.581601
H  1.765515 2.000104 2.460169
H  2.935971 0.692596 2.262251
H  -1.263214 -0.126582 1.554894
H  -0.658798 0.303633 3.14276
H  -0.7704 1.534191 1.894561
H  1.292218 -2.043482 -0.275584
H  0.132604 2.16219 -0.42568
H  1.134511 -3.746129 -2.360829
H  0.732493 -4.392927 -0.763789
H  -0.353925 -4.661577 -2.124494
H  -3.096249 -2.531622 -1.930071
H  -0.411645 -3.329693 1.305878
H  -5.00334 -2.975072 -0.453419
H  -2.314207 -3.769694 2.774823
H  3.57901 4.304656 -1.666074
H  -5.721278 -4.295156 1.707048
H  -4.665347 -4.139958 3.108439
H  -5.473486 -2.724853 2.44861
H  2.245564 6.025941 0.488553
H  3.555022 4.868384 0.770356
H  3.840873 6.298064 -0.212198
H  2.791463 6.470131 -2.555905
H  1.188345 6.202627 -1.873573
H  1.796287 5.151406 -3.162389
elementType: O N C H
totalener: -1038.16702123 hartree
nucrepener: 1989.43370470 hartree
electener: -3027.60072592 hartree
oneelecener: -5364.62845891 hartree
twoeener: 2337.02773299 hartree
cpcmener: -0.03799242 hartree
kineticenergy: 1033.40075997 hartree
xcener: -101.561459294926 hartree
chargesum: 0.0000000
charge: -0.517350 -0.338571 -0.539490 -0.195918 -0.251625 0.116022 0.082625 0.248932 0.184044 -0.320274 -0.309768 0.071072 -0.277978 0.510366 -0.186201 -0.269945 -0.019629 -0.166720 -0.166064 0.155807 -0.207768 -0.261331 -0.253319 0.115860 0.045449 0.083674 0.101190 0.086288 0.097834 0.087284 0.097844 0.093097 0.173250 0.169682 0.107435 0.093162 0.098501 0.138120 0.137723 0.139859 0.139967 0.063133 0.098615 0.091545 0.103306 0.087379 0.092876 0.095820 0.089736 0.088624 0.095829
qa: -0.5174 -0.3386 -0.5395 -0.1959 -0.2516 0.1160 0.0826 0.2489 0.1840 -0.3203 -0.3098 0.0711 -0.2780 0.5104 -0.1862 -0.2699 -0.0196 -0.1667 -0.1661 0.1558 -0.2078 -0.2613 -0.2533 0.1159 0.0454 0.0837 0.1012 0.0863 0.0978 0.0873 0.0978 0.0931 0.1732 0.1697 0.1074 0.0932 0.0985 0.1381 0.1377 0.1399 0.1400 0.0631 0.0986 0.0915 0.1033 0.0874 0.0929 0.0958 0.0897 0.0886 0.0958
va: 1.9860 2.0856 1.9620 3.2188 3.1982 3.7805 3.7608 4.3231 3.7839 3.9477 3.9445 3.4364 3.9428 4.3175 4.0034 3.9798 3.7402 3.9234 3.9325 3.8398 3.9000 3.9029 3.9376 1.0397 1.0263 1.0224 1.0055 1.0048 1.0078 1.0085 1.0041 1.0086 1.0097 1.0428 1.0059 0.9994 1.0060 1.0051 1.0081 1.0002 1.0005 1.0238 0.9982 1.0048 0.9937 1.0075 1.0185 1.0067 1.0056 1.0065 1.0082
dispcorr: -0.025168590 hartree
energy: -1038.192189817991
dipole: 1.58586 -1.61142 -0.02556 4.78211 -5.98881 -1.20670 8.67687 -8.00213 0.67474
magnitude: 1.38277 au
magnitude: 3.51472 debye
