program: Orca
programVersion: 5.0.2
elementType: O O O N N C C C C C C C C C C C C C C C C C C H H H H H H H H H H H H H H H H H H H H H H H H H H H H
charge: 0
multiplicity: 1
keywords: wb97x-d3
keywords: def2-TZVPP
keywords: def2/J RIJCOSX
keywords: DEFGRID2
keywords: scfconv7
keywords: smallprint printgap noloewdin
keywords: NOSOSCF
formula: C18H28N2O3
InChI: InChI=1/C18H28N2O3/c1-11(2)16(20-18(22)23-12(3)4)17(21)19-14(6)15-9-7-13(5)8-10-15/h7-12,14,16,19-20H,1-6H3
51 atoms
O  -0.722278 0.121562 -1.391094
O  1.897502 3.762133 -0.943654
O  3.290091 2.21277 -0.076143
N  0.459074 -1.683596 -0.726039
N  1.05792 1.832859 -0.279514
C  1.071665 0.468211 0.177251
C  0.601814 0.308138 1.643039
C  0.186655 -0.372217 -0.737161
C  -0.420045 -2.680079 -1.315275
C  1.490228 1.106324 2.587914
C  -0.865118 0.677547 1.83396
C  -1.616627 -2.940101 -0.424742
C  0.373147 -3.947439 -1.59579
C  2.175043 2.573054 -0.402771
C  -2.911545 -2.754208 -0.894228
C  -1.447765 -3.365302 0.889896
C  -3.843888 -3.430874 1.235338
C  -4.007601 -2.999437 -0.078851
C  -2.54375 -3.605961 1.704864
C  2.974803 4.701955 -1.135908
C  -5.032169 -3.708395 2.108153
C  3.225324 5.478167 0.141669
C  2.557238 5.595855 -2.283906
H  2.097857 0.099105 0.113586
H  0.721399 -0.751584 1.892165
H  -0.778073 -2.283739 -2.267184
H  2.543174 0.842122 2.479082
H  1.208978 0.908521 3.623593
H  1.391664 2.181462 2.426523
H  -1.067651 1.703979 1.520207
H  -1.540929 0.01915 1.286272
H  -1.137669 0.602531 2.887811
H  1.203457 -2.013802 -0.128712
H  0.187748 2.203885 -0.63142
H  -0.267296 -4.698881 -2.056081
H  1.199391 -3.744697 -2.278449
H  0.784773 -4.377223 -0.680381
H  -3.068566 -2.413263 -1.911283
H  -0.451175 -3.511978 1.291836
H  -5.006613 -2.845518 -0.471067
H  -2.384182 -3.936706 2.724747
H  3.878296 4.15742 -1.419027
H  -4.736794 -3.895118 3.140291
H  -5.733887 -2.873053 2.108847
H  -5.582349 -4.58575 1.761719
H  2.334254 6.028444 0.450093
H  3.531123 4.828767 0.962344
H  4.025444 6.201981 -0.018261
H  2.391072 5.022399 -3.196825
H  3.344725 6.321173 -2.488999
H  1.645445 6.150279 -2.053702
elementType: O N C H
totalener: -1038.16670184 hartree
nucrepener: 1987.75662570 hartree
electener: -3025.92332753 hartree
oneelecener: -5361.24152843 hartree
twoeener: 2335.31820090 hartree
cpcmener: -0.03755870 hartree
kineticenergy: 1033.39283546 hartree
xcener: -101.559873450582 hartree
chargesum: -0.0000000
charge: -0.518074 -0.339820 -0.538937 -0.196258 -0.244689 0.104197 0.081340 0.255901 0.200012 -0.320603 -0.308416 0.037528 -0.281057 0.509253 -0.178606 -0.244240 -0.016612 -0.173585 -0.173203 0.157039 -0.206211 -0.262536 -0.253761 0.114533 0.046260 0.082772 0.098054 0.101100 0.086189 0.093116 0.086047 0.096588 0.173394 0.169397 0.099331 0.107038 0.092454 0.138544 0.138129 0.140293 0.140635 0.063382 0.090328 0.100335 0.102463 0.087751 0.093191 0.095715 0.096088 0.090112 0.088096
qa: -0.5181 -0.3398 -0.5389 -0.1963 -0.2447 0.1042 0.0813 0.2559 0.2000 -0.3206 -0.3084 0.0375 -0.2811 0.5093 -0.1786 -0.2442 -0.0166 -0.1736 -0.1732 0.1570 -0.2062 -0.2625 -0.2538 0.1145 0.0463 0.0828 0.0981 0.1011 0.0862 0.0931 0.0860 0.0966 0.1734 0.1694 0.0993 0.1070 0.0925 0.1385 0.1381 0.1403 0.1406 0.0634 0.0903 0.1003 0.1025 0.0878 0.0932 0.0957 0.0961 0.0901 0.0881
va: 1.9850 2.0854 1.9623 3.2225 3.1968 3.7863 3.7648 4.3114 3.7671 3.9469 3.9487 3.4796 3.9491 4.3172 3.9892 3.9691 3.7363 3.9348 3.9411 3.8386 3.8999 3.9038 3.9373 1.0409 1.0263 1.0230 1.0080 1.0056 1.0043 1.0080 1.0082 1.0042 1.0098 1.0421 1.0057 1.0057 0.9997 1.0062 1.0075 1.0000 1.0006 1.0243 1.0058 0.9971 0.9942 1.0076 1.0182 1.0068 1.0078 1.0054 1.0069
dispcorr: -0.025122191 hartree
energy: -1038.191824025959
dipole: 1.01329 -1.11000 -0.09671 5.25063 -6.41258 -1.16195 8.63327 -7.89598 0.73729
magnitude: 1.37952 au
magnitude: 3.50647 debye
