program: Orca
programVersion: 5.0.2
elementType: O O O N N C C C C C C C C C C C C C C C C C C H H H H H H H H H H H H H H H H H H H H H H H H H H H H
charge: 0
multiplicity: 1
keywords: wb97x-d3
keywords: def2-TZVPP
keywords: def2/J RIJCOSX
keywords: DEFGRID2
keywords: scfconv7
keywords: smallprint printgap noloewdin
keywords: NOSOSCF
formula: C18H28N2O3
InChI: InChI=1/C18H28N2O3/c1-11(2)16(20-18(22)23-12(3)4)17(21)19-14(6)15-9-7-13(5)8-10-15/h7-12,14,16,19-20H,1-6H3
51 atoms
O  -0.73468 0.150682 -1.421587
O  2.078086 3.692833 -1.018147
O  3.344212 2.090771 -0.05806
N  0.379751 -1.655915 -0.650156
N  1.100696 1.839564 -0.335884
C  1.001685 0.510855 0.206716
C  0.433607 0.485146 1.645628
C  0.133998 -0.340936 -0.713367
C  -0.468285 -2.657192 -1.275412
C  1.342016 1.255624 2.595048
C  -0.997416 1.004317 1.727577
C  -1.67551 -2.95923 -0.413486
C  0.35501 -3.90107 -1.574805
C  2.264923 2.506247 -0.435767
C  -2.962796 -2.730579 -0.882199
C  -1.524231 -3.476772 0.871053
C  -3.924158 -3.545144 1.185149
C  -4.070395 -3.022785 -0.096299
C  -2.629673 -3.766695 1.65434
C  3.198532 4.593969 -1.121552
C  -5.117453 -3.835969 2.045699
C  3.397112 5.331022 0.18823
C  2.88282 5.530552 -2.267643
H  2.006299 0.083839 0.238587
H  0.434412 -0.564102 1.959647
H  -0.81702 -2.243426 -2.22291
H  1.350436 2.323721 2.369146
H  2.370945 0.894452 2.558989
H  0.991878 1.146331 3.62272
H  -1.077354 2.030463 1.362321
H  -1.702008 0.390249 1.165436
H  -1.335296 1.006771 2.764979
H  1.092802 -1.980845 -0.013153
H  0.265766 2.258394 -0.717958
H  -0.262542 -4.652742 -2.065158
H  1.187012 -3.662812 -2.23864
H  0.762294 -4.347305 -0.665542
H  -3.10656 -2.325277 -1.877295
H  -0.533229 -3.663805 1.269935
H  -5.063866 -2.839423 -0.489426
H  -2.484261 -4.176871 2.64727
H  4.096737 4.021928 -1.364753
H  -5.412711 -2.954763 2.620089
H  -5.980402 -4.134914 1.450564
H  -4.911777 -4.631633 2.761866
H  3.617393 4.652144 1.012311
H  4.237547 6.02044 0.099765
H  2.512129 5.914473 0.449268
H  2.736215 4.985819 -3.201185
H  3.713597 6.220612 -2.415515
H  1.988056 6.123392 -2.069076
elementType: O N C H
totalener: -1038.16689122 hartree
nucrepener: 1980.39244805 hartree
electener: -3018.55933927 hartree
oneelecener: -5346.47012393 hartree
twoeener: 2327.91078466 hartree
cpcmener: -0.03750912 hartree
kineticenergy: 1033.40252536 hartree
xcener: -101.561315962214 hartree
chargesum: -0.0000000
charge: -0.521387 -0.338895 -0.537460 -0.197938 -0.247210 0.104017 0.084551 0.263550 0.205305 -0.318674 -0.310627 0.017576 -0.280921 0.504978 -0.181638 -0.225465 -0.013538 -0.169954 -0.180065 0.159360 -0.206960 -0.263111 -0.254532 0.113336 0.045188 0.082219 0.085371 0.097985 0.101617 0.089067 0.090677 0.096296 0.173011 0.169937 0.099738 0.106230 0.092158 0.138679 0.139722 0.139734 0.140302 0.063510 0.103342 0.095607 0.094211 0.092824 0.096582 0.087639 0.096240 0.090028 0.087788
qa: -0.5214 -0.3389 -0.5375 -0.1979 -0.2472 0.1040 0.0846 0.2636 0.2053 -0.3187 -0.3106 0.0176 -0.2809 0.5050 -0.1816 -0.2255 -0.0135 -0.1700 -0.1801 0.1594 -0.2070 -0.2631 -0.2545 0.1133 0.0452 0.0822 0.0854 0.0980 0.1016 0.0891 0.0907 0.0963 0.1730 0.1699 0.0997 0.1062 0.0922 0.1387 0.1397 0.1397 0.1403 0.0635 0.1033 0.0956 0.0942 0.0928 0.0966 0.0876 0.0962 0.0900 0.0878
va: 1.9818 2.0842 1.9650 3.2307 3.1977 3.7792 3.7756 4.3105 3.7512 3.9442 3.9510 3.5162 3.9508 4.3264 3.9890 3.9655 3.7303 3.9350 3.9514 3.8354 3.8999 3.9005 3.9388 1.0423 1.0273 1.0255 1.0040 1.0072 1.0055 1.0069 1.0090 1.0041 1.0095 1.0405 1.0053 1.0058 1.0003 1.0071 1.0059 1.0006 1.0003 1.0238 0.9931 1.0013 1.0020 1.0187 1.0069 1.0077 1.0079 1.0054 1.0067
dispcorr: -0.024677121 hartree
energy: -1038.191568337557
dipole: 1.04066 -1.18061 -0.13995 6.01915 -7.05847 -1.03932 8.78946 -7.91873 0.87073
magnitude: 1.36306 au
magnitude: 3.46464 debye
