program: Orca
programVersion: 5.0.2
elementType: O O O N N C C C C C C C C C C C C C C C C C C H H H H H H H H H H H H H H H H H H H H H H H H H H H H
charge: 0
multiplicity: 1
keywords: wb97x-d3
keywords: def2-TZVPP
keywords: def2/J RIJCOSX
keywords: DEFGRID2
keywords: scfconv7
keywords: smallprint printgap noloewdin
keywords: NOSOSCF
formula: C18H28N2O3
InChI: InChI=1/C18H28N2O3/c1-11(2)16(20-18(22)23-12(3)4)17(21)19-14(6)15-9-7-13(5)8-10-15/h7-12,14,16,19-20H,1-6H3
51 atoms
O  0.518352 -0.666592 1.403516
O  1.706264 3.822164 0.731109
O  0.685426 2.930629 -1.072928
N  -0.641006 -0.054824 -0.429774
N  2.013669 1.682422 0.281126
C  1.738125 0.417082 -0.365401
C  2.930823 -0.535422 -0.259038
C  0.484238 -0.172703 0.283617
C  -1.934211 -0.488092 0.063421
C  2.611816 -1.853277 -0.957783
C  4.18336 0.093609 -0.856944
C  -2.098088 -1.99117 -0.002845
C  -3.029427 0.216499 -0.726133
C  1.400078 2.82269 -0.094911
C  -1.725021 -2.711817 -1.133095
C  -2.693523 -2.677122 1.048703
C  -2.559653 -4.768681 -0.161959
C  -1.952726 -4.078167 -1.209314
C  -2.923775 -4.043491 0.969561
C  1.09023 5.108488 0.514249
C  -2.787019 -6.249421 -0.237846
C  1.9984 6.126805 1.168839
C  -0.309305 5.119671 1.097213
H  1.558308 0.61217 -1.42546
H  3.114567 -0.740607 0.801131
H  -2.017619 -0.18129 1.109235
H  1.757763 -2.370409 -0.517091
H  3.462015 -2.533747 -0.894568
H  2.395683 -1.695842 -2.017288
H  4.03835 0.340662 -1.91138
H  4.479722 1.006206 -0.339948
H  5.023202 -0.600019 -0.795215
H  -0.598045 0.380551 -1.339006
H  2.487184 1.660961 1.173247
H  -4.009539 -0.067361 -0.344906
H  -2.936447 1.300314 -0.640904
H  -2.992973 -0.049915 -1.784229
H  -1.254264 -2.207889 -1.969573
H  -2.987707 -2.137328 1.94198
H  -1.657032 -4.616011 -2.103084
H  -3.392817 -4.552448 1.804009
H  1.046464 5.306721 -0.559164
H  -3.698498 -6.543096 0.283466
H  -2.866483 -6.591303 -1.269801
H  -1.96333 -6.800768 0.221691
H  1.597635 7.127977 1.01026
H  2.076297 5.965439 2.245472
H  3.001606 6.10154 0.741641
H  -0.959245 4.386293 0.619571
H  -0.762119 6.100729 0.94946
H  -0.291479 4.917987 2.169834
elementType: O N C H
totalener: -1038.16647755 hartree
nucrepener: 1994.46347954 hartree
electener: -3032.62995709 hartree
oneelecener: -5374.89533183 hartree
twoeener: 2342.26537473 hartree
cpcmener: -0.03671158 hartree
kineticenergy: 1033.40623854 hartree
xcener: -101.559305796393 hartree
chargesum: -0.0000000
charge: -0.529907 -0.337648 -0.535495 -0.159907 -0.223133 0.083486 0.077331 0.228692 0.137522 -0.299932 -0.296651 0.064368 -0.271769 0.516584 -0.235075 -0.188240 -0.021849 -0.172817 -0.162838 0.160227 -0.206126 -0.254070 -0.262984 0.097198 0.046876 0.087468 0.092514 0.096236 0.090289 0.085971 0.091883 0.095340 0.175695 0.169675 0.096152 0.107078 0.095297 0.135674 0.137777 0.140533 0.138431 0.065063 0.095591 0.093319 0.102986 0.090329 0.088356 0.096042 0.093791 0.095846 0.088822
qa: -0.5299 -0.3376 -0.5355 -0.1599 -0.2231 0.0835 0.0773 0.2287 0.1375 -0.2999 -0.2967 0.0644 -0.2718 0.5166 -0.2351 -0.1882 -0.0218 -0.1728 -0.1628 0.1602 -0.2061 -0.2541 -0.2630 0.0972 0.0469 0.0875 0.0925 0.0962 0.0903 0.0860 0.0919 0.0953 0.1757 0.1697 0.0962 0.1071 0.0953 0.1357 0.1378 0.1405 0.1384 0.0651 0.0956 0.0933 0.1030 0.0903 0.0884 0.0960 0.0938 0.0958 0.0888
va: 1.9880 2.0879 1.9691 3.1836 3.1602 3.8367 3.8229 4.2392 3.8134 3.9474 3.9449 3.4804 3.9363 4.3189 3.9608 3.9963 3.7387 3.9360 3.9177 3.8311 3.9005 3.9368 3.9029 1.0324 1.0394 1.0243 1.0126 1.0052 1.0028 1.0023 1.0125 1.0049 1.0120 1.0268 1.0056 1.0074 1.0005 1.0128 1.0044 1.0002 1.0007 1.0231 1.0007 1.0026 0.9930 1.0056 1.0066 1.0080 1.0179 1.0065 1.0074
dispcorr: -0.024349800 hartree
energy: -1038.190827353412
dipole: 3.27104 -3.33260 -0.06155 2.77342 -2.28214 0.49127 -2.79103 2.10754 -0.68349
magnitude: 0.84397 au
magnitude: 2.14521 debye
