program: Orca
programVersion: 5.0.2
elementType: O O O N N C C C C C C C C C C C C C C C C C C H H H H H H H H H H H H H H H H H H H H H H H H H H H H
charge: 0
multiplicity: 1
keywords: wb97x-d3
keywords: def2-TZVPP
keywords: def2/J RIJCOSX
keywords: DEFGRID2
keywords: scfconv7
keywords: smallprint printgap noloewdin
keywords: NOSOSCF
formula: C18H28N2O3
InChI: InChI=1/C18H28N2O3/c1-11(2)16(20-18(22)23-12(3)4)17(21)19-14(6)15-9-7-13(5)8-10-15/h7-12,14,16,19-20H,1-6H3
51 atoms
O  1.756516 -1.610327 1.376029
O  -0.228193 2.381575 -0.029222
O  0.550567 1.188251 -1.778069
N  1.077411 -1.668339 -0.79862
N  1.630493 1.214952 0.22584
C  2.535575 0.124105 -0.088056
C  3.851775 0.251584 0.674762
C  1.77237 -1.165395 0.245298
C  -0.052455 -2.589519 -0.688252
C  4.780482 -0.904835 0.318391
C  4.524716 1.587375 0.376756
C  -1.275944 -1.880502 -0.140328
C  0.288818 -3.891762 0.022941
C  0.632251 1.561368 -0.628208
C  -1.47452 -1.674057 1.222037
C  -2.223103 -1.370705 -1.021961
C  -3.547475 -0.493024 0.796915
C  -2.590665 -0.989283 1.677195
C  -3.340506 -0.690468 -0.563796
C  -1.41997 2.75003 -0.742691
C  -4.779255 0.200533 1.300449
C  -1.139532 3.905831 -1.68452
C  -2.449976 3.094429 0.314014
H  2.754817 0.178621 -1.157701
H  3.633982 0.19082 1.746212
H  -0.279176 -2.85406 -1.724729
H  4.357605 -1.871148 0.589189
H  5.730229 -0.807433 0.844959
H  5.001873 -0.916593 -0.751517
H  3.898619 2.43731 0.644607
H  5.459126 1.675866 0.931986
H  4.764011 1.677775 -0.685198
H  1.043695 -1.072878 -1.612517
H  1.475698 1.399928 1.205287
H  -0.544917 -4.585674 -0.083469
H  1.168871 -4.347158 -0.430909
H  0.491033 -3.758858 1.08109
H  -0.751357 -2.039689 1.937734
H  -2.088984 -1.507598 -2.08906
H  -2.721254 -0.842707 2.743152
H  -4.064107 -0.312279 -1.276781
H  -1.767705 1.885608 -1.313899
H  -5.595692 -0.509245 1.448784
H  -4.602301 0.692112 2.256857
H  -5.132384 0.956332 0.598928
H  -0.40975 3.633391 -2.44484
H  -2.057381 4.198357 -2.195966
H  -0.770208 4.775571 -1.138888
H  -2.137578 3.949697 0.914973
H  -2.626934 2.248458 0.977461
H  -3.396439 3.350498 -0.16283
totalener: -1038.13412626 hartree
nucrepener: 2119.07728031 hartree
electener: -3157.21140657 hartree
oneelecener: -5623.31218966 hartree
twoeener: 2466.10078309 hartree
kineticenergy: 1033.46754035 hartree
xcener: -101.564678811142 hartree
chargesum: 0.0000000
charge: -0.427504 -0.315766 -0.460799 -0.185453 -0.207993 0.064383 0.050236 0.211889 0.136134 -0.289185 -0.255898 -0.003567 -0.267413 0.469310 -0.136999 -0.149902 -0.043700 -0.119983 -0.163238 0.164011 -0.215638 -0.261749 -0.248763 0.092498 0.044941 0.079895 0.105194 0.082955 0.078449 0.087135 0.086512 0.075020 0.161165 0.144044 0.096576 0.089332 0.100347 0.133108 0.100571 0.108729 0.109522 0.057477 0.111946 0.089230 0.085419 0.104910 0.080771 0.083628 0.094816 0.094310 0.079087
qa: -0.4275 -0.3158 -0.4608 -0.1855 -0.2080 0.0644 0.0502 0.2119 0.1361 -0.2892 -0.2559 -0.0036 -0.2674 0.4693 -0.1370 -0.1499 -0.0437 -0.1200 -0.1632 0.1640 -0.2156 -0.2617 -0.2488 0.0925 0.0449 0.0799 0.1052 0.0830 0.0784 0.0871 0.0865 0.0750 0.1612 0.1440 0.0966 0.0893 0.1003 0.1331 0.1006 0.1087 0.1095 0.0575 0.1119 0.0892 0.0854 0.1049 0.0808 0.0836 0.0948 0.0943 0.0791
va: 2.0785 2.0927 2.0329 3.1737 3.1493 3.8877 3.8764 4.2344 3.9000 3.9530 3.9309 3.5867 3.9164 4.3331 3.9745 3.9985 3.7299 3.9741 3.9175 3.8254 3.8971 3.9273 3.9306 1.0295 1.0376 1.0025 1.0157 1.0053 1.0057 1.0186 1.0073 1.0058 1.0397 1.0441 1.0038 1.0096 1.0198 1.0216 1.0120 1.0079 1.0084 1.0274 0.9954 1.0025 1.0008 1.0180 1.0086 1.0087 1.0131 1.0081 1.0080
dispcorr: -0.028893930 hartree
energy: -1038.163020188292
dipole: 0.73914 -1.33565 -0.59651 6.81143 -6.30680 0.50463 0.57346 -0.78658 -0.21311
magnitude: 0.80988 au
magnitude: 2.05854 debye
