program: Orca
programVersion: 5.0.2
elementType: O O O N N C C C C C C C C C C C C C C C C C C H H H H H H H H H H H H H H H H H H H H H H H H H H H H
charge: 0
multiplicity: 1
keywords: wb97x-d3
keywords: def2-TZVPP
keywords: def2/J RIJCOSX
keywords: DEFGRID2
keywords: scfconv7
keywords: smallprint printgap noloewdin
keywords: NOSOSCF
formula: C18H28N2O3
InChI: InChI=1/C18H28N2O3/c1-11(2)16(20-18(22)23-12(3)4)17(21)19-14(6)15-9-7-13(5)8-10-15/h7-12,14,16,19-20H,1-6H3
51 atoms
O  2.289977 -1.240192 1.189392
O  1.314728 3.393571 0.660766
O  0.144882 2.065827 -0.739665
N  0.331071 -0.936121 0.098405
N  2.267622 1.551345 -0.105621
C  2.28529 0.235696 -0.715607
C  3.703617 -0.17614 -1.110024
C  1.650229 -0.741084 0.283778
C  -0.501614 -1.655694 1.048411
C  3.692428 -1.552021 -1.769317
C  4.333553 0.851732 -2.04449
C  -1.787911 -2.05879 0.368651
C  -0.755334 -0.838327 2.314309
C  1.147758 2.315186 -0.108216
C  -2.689972 -1.100767 -0.086204
C  -2.102012 -3.396862 0.173255
C  -4.184951 -2.815713 -0.908087
C  -3.865055 -1.474323 -0.716945
C  -3.282116 -3.769417 -0.452586
C  0.201759 4.287784 0.817395
C  -5.474708 -3.218462 -1.56142
C  0.787546 5.625108 1.223169
C  -0.77123 3.746132 1.850165
H  1.682034 0.292903 -1.62594
H  4.303349 -0.247471 -0.196396
H  0.040492 -2.560875 1.330988
H  3.077361 -1.552254 -2.672362
H  3.318747 -2.327093 -1.102093
H  4.701865 -1.838791 -2.065185
H  5.346232 0.550125 -2.314151
H  3.760957 0.942234 -2.970253
H  4.393523 1.843682 -1.598709
H  -0.132942 -0.379639 -0.602457
H  2.966213 1.744399 0.594967
H  -1.388227 -1.395139 3.005343
H  0.183299 -0.611865 2.817526
H  -1.25659 0.10278 2.084108
H  -2.477017 -0.044937 0.043793
H  -1.412666 -4.161848 0.510191
H  -4.545767 -0.707622 -1.067651
H  -3.499302 -4.821666 -0.593806
H  -0.309334 4.390137 -0.142939
H  -5.383403 -4.175459 -2.074385
H  -6.273933 -3.32061 -0.824603
H  -5.802182 -2.480378 -2.293125
H  1.311768 5.557957 2.177338
H  1.485427 5.997443 0.473538
H  -0.009848 6.3602 1.331045
H  -1.597857 4.444556 1.984142
H  -0.284133 3.61483 2.817328
H  -1.195039 2.791664 1.541005
totalener: -1038.13851665 hartree
nucrepener: 2009.03221094 hartree
electener: -3047.17072759 hartree
oneelecener: -5403.00484894 hartree
twoeener: 2355.83412135 hartree
kineticenergy: 1033.45485682 hartree
xcener: -101.560773161750 hartree
chargesum: 0.0000000
charge: -0.418370 -0.316950 -0.458336 -0.190726 -0.221085 0.036937 0.049849 0.225790 0.151091 -0.288316 -0.253898 0.037424 -0.276029 0.477784 -0.179053 -0.133993 0.009517 -0.174266 -0.136216 0.147077 -0.205677 -0.232263 -0.251961 0.090367 0.048441 0.063255 0.079392 0.106361 0.083031 0.086586 0.076122 0.084065 0.163932 0.145179 0.097519 0.111122 0.066312 0.125688 0.109794 0.110488 0.108384 0.065456 0.084479 0.099711 0.085242 0.082597 0.092211 0.078170 0.085344 0.085937 0.086487
qa: -0.4184 -0.3170 -0.4583 -0.1907 -0.2211 0.0369 0.0498 0.2258 0.1511 -0.2883 -0.2539 0.0374 -0.2760 0.4778 -0.1791 -0.1340 0.0095 -0.1743 -0.1362 0.1471 -0.2057 -0.2323 -0.2520 0.0904 0.0484 0.0633 0.0794 0.1064 0.0830 0.0866 0.0761 0.0841 0.1639 0.1452 0.0975 0.1111 0.0663 0.1257 0.1098 0.1105 0.1084 0.0655 0.0845 0.0997 0.0852 0.0826 0.0922 0.0782 0.0853 0.0859 0.0865
va: 2.1005 2.0972 2.0379 3.2181 3.1316 3.8960 3.8749 4.2199 3.8327 3.9547 3.9314 3.6129 3.9341 4.3279 4.0121 4.0099 3.7798 4.0399 3.9796 3.8654 3.9111 3.9348 3.9100 1.0283 1.0373 1.0365 1.0054 1.0151 1.0047 1.0075 1.0058 1.0183 1.0311 1.0425 1.0116 1.0140 1.0037 1.0108 1.0107 1.0083 1.0085 1.0220 1.0047 0.9922 1.0042 1.0088 1.0107 1.0079 1.0111 1.0095 1.0165
dispcorr: -0.024684309 hartree
energy: -1038.163200962110
dipole: 0.52081 -1.08327 -0.56246 6.32131 -5.72796 0.59335 -1.28515 1.08169 -0.20346
magnitude: 0.84251 au
magnitude: 2.14148 debye
