program: Orca
programVersion: 5.0.2
elementType: O O O N N C C C C C C C C C C C C C C C C C C H H H H H H H H H H H H H H H H H H H H H H H H H H H H
charge: 0
multiplicity: 1
keywords: wb97x-d3
keywords: def2-TZVPP
keywords: def2/J RIJCOSX
keywords: DEFGRID2
keywords: scfconv7
keywords: smallprint printgap noloewdin
keywords: NOSOSCF
formula: C18H28N2O3
InChI: InChI=1/C18H28N2O3/c1-11(2)16(20-18(22)23-12(3)4)17(21)19-14(6)15-9-7-13(5)8-10-15/h7-12,14,16,19-20H,1-6H3
51 atoms
O  2.03771 -1.139188 1.370171
O  1.374657 3.497018 0.767593
O  0.122271 2.250337 -0.637844
N  0.111718 -0.845589 0.214777
N  2.190038 1.581111 0.027834
C  2.113498 0.267141 -0.577338
C  3.497648 -0.238221 -0.985206
C  1.429392 -0.662539 0.431482
C  -0.752348 -1.516122 1.171521
C  3.39036 -1.617492 -1.627729
C  4.175257 0.740039 -1.939405
C  -1.893237 -2.186095 0.443284
C  -1.230486 -0.556496 2.259279
C  1.133822 2.429508 0.002637
C  -1.967179 -3.572083 0.372193
C  -2.88987 -1.445964 -0.184032
C  -4.003742 -3.461913 -0.925364
C  -3.005581 -4.199398 -0.296656
C  -3.92425 -2.074577 -0.860101
C  0.377176 4.528276 0.819169
C  -5.139251 -4.146566 -1.628769
C  0.523794 5.457338 -0.371814
C  0.572359 5.244581 2.140262
H  1.506229 0.362089 -1.481553
H  4.104609 -0.335695 -0.078773
H  -0.145475 -2.289988 1.644076
H  2.761772 -1.589071 -2.520862
H  2.978411 -2.359946 -0.945668
H  4.374791 -1.971072 -1.935224
H  3.597896 0.85321 -2.859798
H  4.296481 1.73165 -1.505242
H  5.165742 0.377865 -2.216824
H  -0.328726 -0.284595 -0.497832
H  2.894188 1.724511 0.734785
H  -0.37853 -0.155426 2.807452
H  -1.787567 0.281598 1.838539
H  -1.88026 -1.070726 2.967298
H  -1.199135 -4.171571 0.846499
H  -2.870259 -0.361954 -0.149717
H  -3.036896 -5.282276 -0.332835
H  -4.68493 -1.473066 -1.343673
H  -0.612928 4.066042 0.798307
H  -5.659324 -3.470279 -2.306048
H  -4.793096 -4.999008 -2.213423
H  -5.875063 -4.522509 -0.915228
H  1.510349 5.922682 -0.386317
H  0.372536 4.928702 -1.3117
H  -0.220516 6.252623 -0.317239
H  -0.180056 6.025272 2.251986
H  1.554006 5.716698 2.19722
H  0.47104 4.561025 2.982981
totalener: -1038.13847716 hartree
nucrepener: 1988.01695011 hartree
electener: -3026.15542727 hartree
oneelecener: -5361.02810959 hartree
twoeener: 2334.87268232 hartree
kineticenergy: 1033.46018487 hartree
xcener: -101.560861811345 hartree
chargesum: 0.0000000
charge: -0.418567 -0.318838 -0.458858 -0.176166 -0.223039 0.034087 0.050102 0.226352 0.143143 -0.287713 -0.255703 0.031566 -0.279513 0.480099 -0.129756 -0.178691 0.008970 -0.145952 -0.161578 0.145358 -0.207386 -0.257045 -0.227768 0.087096 0.049005 0.066094 0.079792 0.105848 0.083221 0.075835 0.084749 0.086663 0.156549 0.146998 0.106167 0.078132 0.097604 0.111285 0.123234 0.110324 0.109498 0.059614 0.081334 0.090301 0.099470 0.081532 0.102506 0.081915 0.077718 0.082211 0.092202
qa: -0.4186 -0.3188 -0.4589 -0.1762 -0.2230 0.0341 0.0501 0.2264 0.1431 -0.2877 -0.2557 0.0316 -0.2795 0.4801 -0.1298 -0.1787 0.0090 -0.1460 -0.1616 0.1454 -0.2074 -0.2570 -0.2278 0.0871 0.0490 0.0661 0.0798 0.1058 0.0832 0.0758 0.0847 0.0867 0.1565 0.1470 0.1062 0.0781 0.0976 0.1113 0.1232 0.1103 0.1095 0.0596 0.0813 0.0903 0.0995 0.0815 0.1025 0.0819 0.0777 0.0822 0.0922
va: 2.1013 2.0967 2.0406 3.2088 3.1334 3.9144 3.8666 4.2196 3.8328 3.9557 3.9312 3.6459 3.9452 4.3241 4.0067 4.0199 3.7817 3.9821 4.0253 3.8733 3.9105 3.9095 3.9274 1.0297 1.0377 1.0460 1.0055 1.0142 1.0047 1.0055 1.0189 1.0075 1.0326 1.0421 1.0091 1.0069 1.0100 1.0100 1.0097 1.0078 1.0087 1.0240 1.0073 1.0011 0.9927 1.0091 1.0182 1.0095 1.0079 1.0091 1.0110
dispcorr: -0.023836768 hartree
energy: -1038.162313924737
dipole: 1.91781 -2.39378 -0.47597 7.32884 -6.82098 0.50786 -4.12810 3.83666 -0.29143
magnitude: 0.75459 au
magnitude: 1.91800 debye
