program: Orca
programVersion: 5.0.2
elementType: O O O N N C C C C C C C C C C C C C C C C C C H H H H H H H H H H H H H H H H H H H H H H H H H H H H
charge: 0
multiplicity: 1
keywords: wb97x-d3
keywords: def2-TZVPP
keywords: def2/J RIJCOSX
keywords: DEFGRID2
keywords: scfconv7
keywords: smallprint printgap noloewdin
keywords: NOSOSCF
formula: C18H28N2O3
InChI: InChI=1/C18H28N2O3/c1-11(2)16(20-18(22)23-12(3)4)17(21)19-14(6)15-9-7-13(5)8-10-15/h7-12,14,16,19-20H,1-6H3
51 atoms
O  1.998223 -0.908195 1.510953
O  1.429613 3.580822 0.41097
O  0.196123 2.204697 -0.885451
N  0.138067 -0.783884 0.223566
N  2.261136 1.610278 -0.140232
C  2.178597 0.237387 -0.593507
C  3.565939 -0.335925 -0.883778
C  1.440281 -0.559863 0.48812
C  -0.777019 -1.349407 1.200734
C  3.449086 -1.774004 -1.379225
C  4.308274 0.520513 -1.90463
C  -1.886353 -2.078742 0.480213
C  -1.290277 -0.28625 2.169243
C  1.199144 2.446254 -0.252686
C  -1.916984 -3.466127 0.458547
C  -2.890314 -1.39196 -0.198847
C  -3.926093 -3.467248 -0.886614
C  -2.921954 -4.149249 -0.210827
C  -3.889081 -2.074689 -0.8720
C  0.390009 4.570224 0.441113
C  -5.025376 -4.198439 -1.600408
C  1.074992 5.891595 0.726238
C  -0.643641 4.215165 1.494711
H  1.608772 0.236597 -1.526702
H  4.131117 -0.347987 0.054238
H  -0.204043 -2.079467 1.775183
H  4.435898 -2.182456 -1.59838
H  2.862786 -1.826989 -2.299612
H  2.984608 -2.429201 -0.643229
H  3.766824 0.559047 -2.852651
H  4.448281 1.546497 -1.566682
H  5.294746 0.102464 -2.107945
H  -0.264222 -0.316762 -0.574272
H  2.945845 1.817759 0.569935
H  -1.980303 -0.724382 2.890299
H  -0.458268 0.154392 2.717399
H  -1.813502 0.516225 1.647312
H  -1.143865 -4.024579 0.972965
H  -2.902071 -0.307702 -0.205448
H  -2.921826 -5.232779 -0.205941
H  -4.656553 -1.514296 -1.393531
H  -0.090709 4.61149 -0.539387
H  -4.851636 -5.273655 -1.609377
H  -5.990944 -4.027384 -1.121499
H  -5.117136 -3.870558 -2.636629
H  1.815719 6.128522 -0.037324
H  0.339348 6.695779 0.738531
H  1.573643 5.880152 1.696414
H  -1.418845 4.981381 1.528711
H  -0.189272 4.154164 2.4847
H  -1.129457 3.265365 1.275644
totalener: -1038.13815632 hartree
nucrepener: 1998.66207796 hartree
electener: -3036.80023428 hartree
oneelecener: -5382.29691448 hartree
twoeener: 2345.49668020 hartree
kineticenergy: 1033.46120404 hartree
xcener: -101.560912883726 hartree
chargesum: -0.0000000
charge: -0.418726 -0.316709 -0.453495 -0.168706 -0.224302 0.041666 0.046197 0.219544 0.147190 -0.287380 -0.254808 0.025162 -0.283196 0.475691 -0.138104 -0.168000 0.004217 -0.131394 -0.171945 0.145443 -0.208307 -0.232277 -0.252564 0.084642 0.049816 0.066903 0.083873 0.079731 0.104928 0.076055 0.085042 0.086534 0.155738 0.146259 0.099984 0.108564 0.069108 0.110656 0.127039 0.108112 0.112662 0.064775 0.078866 0.098600 0.094769 0.092241 0.077786 0.082398 0.083439 0.084251 0.092032
qa: -0.4187 -0.3167 -0.4535 -0.1687 -0.2243 0.0417 0.0462 0.2195 0.1472 -0.2874 -0.2548 0.0252 -0.2832 0.4757 -0.1381 -0.1680 0.0042 -0.1314 -0.1719 0.1454 -0.2083 -0.2323 -0.2526 0.0846 0.0498 0.0669 0.0839 0.0797 0.1049 0.0761 0.0850 0.0865 0.1557 0.1463 0.1000 0.1086 0.0691 0.1107 0.1270 0.1081 0.1127 0.0648 0.0789 0.0986 0.0948 0.0922 0.0778 0.0824 0.0834 0.0843 0.0920
va: 2.1013 2.0973 2.0475 3.2048 3.1371 3.9234 3.8668 4.2125 3.8156 3.9569 3.9324 3.6538 3.9454 4.3346 4.0229 3.9985 3.7915 3.9703 4.0278 3.8704 3.9111 3.9335 3.9068 1.0290 1.0379 1.0429 1.0048 1.0056 1.0135 1.0056 1.0182 1.0074 1.0323 1.0427 1.0112 1.0087 1.0045 1.0106 1.0058 1.0092 1.0072 1.0221 1.0091 0.9942 0.9976 1.0105 1.0079 1.0091 1.0107 1.0092 1.0193
dispcorr: -0.024418057 hartree
energy: -1038.162574374969
dipole: 0.92277 -1.40510 -0.48233 5.42250 -4.99962 0.42288 -2.33232 1.98362 -0.34871
magnitude: 0.73011 au
magnitude: 1.85580 debye
