program: Orca
programVersion: 5.0.2
elementType: O O O N N C C C C C C C C C C C C C C C C C C H H H H H H H H H H H H H H H H H H H H H H H H H H H H
charge: 0
multiplicity: 1
keywords: wb97x-d3
keywords: def2-TZVPP
keywords: def2/J RIJCOSX
keywords: DEFGRID2
keywords: scfconv7
keywords: smallprint printgap noloewdin
keywords: NOSOSCF
formula: C18H28N2O3
InChI: InChI=1/C18H28N2O3/c1-11(2)16(20-18(22)23-12(3)4)17(21)19-14(6)15-9-7-13(5)8-10-15/h7-12,14,16,19-20H,1-6H3
51 atoms
O  2.198237 -1.865558 -1.499181
O  0.207673 2.885671 0.091916
O  0.158156 1.349413 -1.566492
N  1.000296 -1.227343 0.313341
N  1.810683 1.36116 -0.01306
C  2.594838 0.335825 -0.667825
C  3.985824 0.259616 -0.007273
C  1.898686 -1.02819 -0.672522
C  0.150513 -2.400428 0.407931
C  3.939472 -0.248855 1.431786
C  4.971005 -0.557391 -0.834876
C  -1.297688 -1.959811 0.336091
C  0.509053 -3.224535 1.636522
C  0.671773 1.834478 -0.590346
C  -2.173534 -2.044544 1.407875
C  -1.765703 -1.39743 -0.851419
C  -3.948851 -1.023474 0.119692
C  -3.479577 -1.580239 1.300362
C  -3.065973 -0.94285 -0.95748
C  -1.0620 3.432269 -0.30351
C  -5.360759 -0.53124 -0.007619
C  -1.07108 4.871016 0.172015
C  -2.1938 2.615666 0.293687
H  2.734671 0.591576 -1.722837
H  4.358073 1.292154 0.007096
H  0.368074 -3.001368 -0.47714
H  3.244244 0.309955 2.061132
H  4.924681 -0.166543 1.891361
H  3.646377 -1.29831 1.474152
H  5.970252 -0.479903 -0.404972
H  4.699603 -1.610889 -0.867533
H  5.022859 -0.200791 -1.863587
H  0.772316 -0.446711 0.906914
H  2.250391 1.928492 0.69279
H  -0.116872 -4.113681 1.713577
H  1.546727 -3.548579 1.570514
H  0.39926 -2.651439 2.558875
H  -1.851267 -2.474921 2.347389
H  -1.09692 -1.301977 -1.697996
H  -4.140156 -1.655328 2.156118
H  -3.39962 -0.508935 -1.892977
H  -1.133487 3.407461 -1.393551
H  -5.399032 0.456453 -0.468551
H  -5.957938 -1.199877 -0.630479
H  -5.851788 -0.463395 0.962405
H  -2.003127 5.351141 -0.124847
H  -0.995772 4.932634 1.258443
H  -0.249909 5.440765 -0.262085
H  -3.153222 3.040786 -0.003791
H  -2.151061 2.623035 1.383997
H  -2.174316 1.581246 -0.047753
totalener: -1038.13407817 hartree
nucrepener: 2085.11287737 hartree
electener: -3123.24695555 hartree
oneelecener: -5555.28019559 hartree
twoeener: 2432.03324004 hartree
kineticenergy: 1033.46470321 hartree
xcener: -101.565789923721 hartree
chargesum: -0.0000000
charge: -0.400926 -0.322063 -0.406746 -0.164812 -0.270470 0.108500 0.006357 0.238210 0.132627 -0.280824 -0.267828 -0.047243 -0.287540 0.442846 -0.127987 -0.143804 0.008864 -0.137208 -0.174569 0.153046 -0.202978 -0.236585 -0.234787 0.111117 0.042416 0.097985 0.071704 0.097754 0.088124 0.081872 0.097733 0.083342 0.140928 0.141540 0.102788 0.100119 0.069533 0.116209 0.130822 0.104491 0.113849 0.065710 0.086858 0.101836 0.079044 0.079451 0.080714 0.091181 0.079269 0.079019 0.080511
qa: -0.4009 -0.3221 -0.4067 -0.1648 -0.2705 0.1085 0.0064 0.2382 0.1326 -0.2808 -0.2678 -0.0472 -0.2875 0.4428 -0.1280 -0.1438 0.0089 -0.1372 -0.1746 0.1530 -0.2030 -0.2366 -0.2348 0.1111 0.0424 0.0980 0.0717 0.0978 0.0881 0.0819 0.0977 0.0833 0.1409 0.1415 0.1028 0.1001 0.0695 0.1162 0.1308 0.1045 0.1138 0.0657 0.0869 0.1018 0.0790 0.0795 0.0807 0.0912 0.0793 0.0790 0.0805
va: 2.1305 2.0857 2.0990 3.1269 3.1121 3.8133 3.9018 4.2153 3.7566 3.9466 3.9725 3.7576 3.9636 4.3563 3.9721 3.9396 3.7255 4.0246 3.9143 3.8800 3.9074 3.9380 3.9053 1.0345 1.0109 1.0433 1.0135 1.0084 1.0081 1.0013 1.0157 1.0088 1.0486 1.0431 1.0049 1.0098 1.0039 1.0064 1.0187 1.0097 1.0089 1.0228 0.9997 0.9946 1.0083 1.0081 1.0089 1.0109 1.0115 1.0123 1.0296
dispcorr: -0.027745037 hartree
energy: -1038.161823208676
dipole: 0.28262 -0.55370 -0.27108 5.29928 -4.09300 1.20628 9.14363 -7.64153 1.50210
magnitude: 1.94548 au
magnitude: 4.94502 debye
