program: Orca
programVersion: 5.0.2
elementType: O O O N N C C C C C C C C C C C C C C C C C C H H H H H H H H H H H H H H H H H H H H H H H H H H H H
charge: 0
multiplicity: 1
keywords: wb97x-d3
keywords: def2-TZVPP
keywords: def2/J RIJCOSX
keywords: DEFGRID2
keywords: scfconv7
keywords: smallprint printgap noloewdin
keywords: NOSOSCF
formula: C18H28N2O3
InChI: InChI=1/C18H28N2O3/c1-11(2)16(20-18(22)23-12(3)4)17(21)19-14(6)15-9-7-13(5)8-10-15/h7-12,14,16,19-20H,1-6H3
51 atoms
O  1.7932 -2.310288 -1.001084
O  0.850625 3.061792 0.643291
O  0.459087 2.251393 -1.428313
N  0.608622 -1.237737 0.604125
N  1.762473 1.135271 0.071775
C  2.144516 0.045115 -0.793657
C  3.669856 -0.103489 -0.909062
C  1.497063 -1.292504 -0.409019
C  -0.217084 -2.359922 1.004482
C  4.29196 1.136036 -1.539642
C  4.330385 -0.430605 0.427049
C  -1.614132 -2.235621 0.43575
C  -0.213039 -2.499618 2.522618
C  0.977468 2.167137 -0.344525
C  -2.478129 -1.229839 0.853877
C  -2.062987 -3.118801 -0.53808
C  -4.203885 -2.000178 -0.654111
C  -3.750112 -1.113622 0.316736
C  -3.3372 -3.005322 -1.070772
C  -0.001224 4.195518 0.414824
C  -5.574663 -1.870127 -1.251215
C  0.447196 5.265623 1.390023
C  -1.456707 3.810232 0.609556
H  1.752207 0.279865 -1.78677
H  3.834649 -0.95026 -1.578162
H  0.249961 -3.246618 0.574722
H  5.360552 0.989602 -1.701353
H  4.176905 2.016645 -0.904831
H  3.839673 1.365008 -2.505473
H  3.90799 -1.323543 0.889154
H  5.395889 -0.614685 0.287408
H  4.253706 0.393477 1.142043
H  0.361559 -0.325096 0.949542
H  2.242273 1.243246 0.950735
H  -0.821291 -3.349436 2.829781
H  0.802014 -2.652609 2.888758
H  -0.617499 -1.613705 3.016207
H  -2.1679 -0.520599 1.61381
H  -1.403897 -3.903315 -0.889974
H  -4.402008 -0.319383 0.660785
H  -3.660515 -3.71062 -1.827569
H  0.145512 4.548538 -0.608944
H  -6.182984 -1.14838 -0.707467
H  -5.522702 -1.537102 -2.289304
H  -6.106518 -2.822069 -1.244319
H  -0.142326 6.17028 1.242565
H  0.312421 4.945274 2.424062
H  1.495868 5.524455 1.245038
H  -2.094325 4.682095 0.459593
H  -1.63178 3.440799 1.621508
H  -1.769581 3.048472 -0.102815
totalener: -1038.13641385 hartree
nucrepener: 2015.11875352 hartree
electener: -3053.25516737 hartree
oneelecener: -5415.00893383 hartree
twoeener: 2361.75376646 hartree
kineticenergy: 1033.46594883 hartree
xcener: -101.564286959193 hartree
chargesum: 0.0000000
charge: -0.414321 -0.323498 -0.407797 -0.193332 -0.309713 0.088803 0.041934 0.250004 0.121287 -0.280568 -0.292702 0.028427 -0.249991 0.467360 -0.175297 -0.108956 0.008221 -0.155291 -0.150514 0.143959 -0.208598 -0.229935 -0.260632 0.113579 0.058756 0.072300 0.092451 0.070174 0.098112 0.104098 0.092087 0.058875 0.137366 0.157702 0.097644 0.097720 0.071411 0.099706 0.116774 0.104634 0.110776 0.066427 0.077417 0.101171 0.092804 0.079287 0.080536 0.091740 0.083771 0.075814 0.108019
qa: -0.4143 -0.3235 -0.4078 -0.1933 -0.3097 0.0888 0.0419 0.2500 0.1213 -0.2806 -0.2927 0.0284 -0.2500 0.4674 -0.1753 -0.1090 0.0082 -0.1553 -0.1505 0.1440 -0.2086 -0.2299 -0.2606 0.1136 0.0588 0.0723 0.0925 0.0702 0.0981 0.1041 0.0921 0.0589 0.1374 0.1577 0.0976 0.0977 0.0714 0.0997 0.1168 0.1046 0.1108 0.0664 0.0774 0.1012 0.0928 0.0793 0.0805 0.0917 0.0838 0.0758 0.1080
va: 2.1141 2.0697 2.1033 3.1599 3.1189 3.8091 3.8510 4.3135 3.8450 3.9367 3.9437 3.6048 3.9591 4.3336 4.0440 4.0088 3.7891 4.0388 3.9862 3.8697 3.9097 3.9299 3.9005 1.0400 1.0386 1.0475 1.0064 1.0111 1.0061 1.0088 1.0077 1.0071 1.0543 1.0395 1.0088 1.0089 1.0049 1.0116 1.0126 1.0100 1.0073 1.0213 1.0089 0.9936 0.9986 1.0084 1.0087 1.0109 1.0108 1.0089 1.0189
dispcorr: -0.024197610 hartree
energy: -1038.160611458026
dipole: 2.07802 -2.40180 -0.32378 9.86903 -8.92078 0.94825 6.77556 -5.44727 1.32829
magnitude: 1.66384 au
magnitude: 4.22915 debye
